BDBM50173389 CHEMBL198150::N-Ethyl-2-(4-methanesulfonyl-phenyl)-N-{1-[3-(4-methanesulfonyl-phenyl)-3-phenyl-propyl]-piperidin-4-yl}-acetamide::N-ethyl-2-(4-(methylsulfonyl)phenyl)-N-(1-(3-(4-(methylsulfonyl)phenyl)-3-phenylpropyl)piperidin-4-yl)acetamide
SMILES: CCN(C1CCN(CCC(c2ccccc2)c2ccc(cc2)S(C)(=O)=O)CC1)C(=O)Cc1ccc(cc1)S(C)(=O)=O
InChI Key: InChIKey=COHWEVSELQDEED-UHFFFAOYSA-N
Data: 2 IC50
Activity Spreadsheet -- Enzyme Inhibition Constant Data from BindingDB
Found 2 hits for monomerid = 50173389
Trg + Lig
Ki
nM
ΔG°
kcal/mole
IC50
nM
Kd
nM
EC50/IC50
nM
koff
s-1
kon
M-1s-1
pHTemp
°C
C-C chemokine receptor type 5
(Homo sapiens (Human))
BDBM50173389
(CHEMBL198150 | N-Ethyl-2-(4-methanesulfonyl-phenyl...)
Show SMILES CCN(C1CCN(CCC(c2ccccc2)c2ccc(cc2)S(C)(=O)=O)CC1)C(=O)Cc1ccc(cc1)S(C)(=O)=O
Show InChI InChI=1S/C32H40N2O5S2/c1-4-34(32(35)24-25-10-14-29(15-11-25)40(2,36)37)28-18-21-33(22-19-28)23-20-31(26-8-6-5-7-9-26)27-12-16-30(17-13-27)41(3,38)39/h5-17,28,31H,4,18-24H2,1-3H3
n/an/a 1.70n/an/an/an/an/an/a
AstraZeneca
Curated by ChEMBL
Assay Description
Displacement of [125I]MIP-1alpha to human recombinant CCR5 expressed in CHO cells
Bioorg Med Chem Lett 16: 3533-6 (2006)
Article DOI: 10.1016/j.bmcl.2006.03.089
BindingDB Entry DOI: 10.7270/Q24B30XJ
C-C chemokine receptor type 5
(Homo sapiens (Human))
BDBM50173389
(CHEMBL198150 | N-Ethyl-2-(4-methanesulfonyl-phenyl...)
Show SMILES CCN(C1CCN(CCC(c2ccccc2)c2ccc(cc2)S(C)(=O)=O)CC1)C(=O)Cc1ccc(cc1)S(C)(=O)=O
Show InChI InChI=1S/C32H40N2O5S2/c1-4-34(32(35)24-25-10-14-29(15-11-25)40(2,36)37)28-18-21-33(22-19-28)23-20-31(26-8-6-5-7-9-26)27-12-16-30(17-13-27)41(3,38)39/h5-17,28,31H,4,18-24H2,1-3H3
n/an/a 1.70n/an/an/an/an/an/a
AstraZeneca
Curated by ChEMBL
Assay Description
Displacement of [125I]-MIP-1 alpha from human C-C chemokine receptor type 5 expressed in CHO cells
Bioorg Med Chem Lett 15: 5012-5 (2005)
Article DOI: 10.1016/j.bmcl.2005.08.014
BindingDB Entry DOI: 10.7270/Q23R0SFG