BDBM50173437 (3R,3aS,4S,4aR,8aS,9aR)-4-{(E)-2-[5-(3-Chloro-phenyl)-pyridin-2-yl]-vinyl}-3-methyl-decahydro-naphtho[2,3-c]furan-1-one::CHEMBL199201
SMILES: C[C@H]1OC(=O)[C@@H]2C[C@@H]3CCCC[C@H]3[C@H](\C=C\c3ccc(cn3)-c3cccc(Cl)c3)[C@H]12
InChI Key: InChIKey=URIAMYZTLSIYIG-HLBWOJLBSA-N
Data: 1 IC50
Activity Spreadsheet -- Enzyme Inhibition Constant Data from BindingDB
Found 1 hit for monomerid = 50173437
Trg + Lig
Ki
nM
ΔG°
kcal/mole
IC50
nM
Kd
nM
EC50/IC50
nM
koff
s-1
kon
M-1s-1
pHTemp
°C
Proteinase-activated receptor 1
(Homo sapiens (Human))
BDBM50173437
((3R,3aS,4S,4aR,8aS,9aR)-4-{(E)-2-[5-(3-Chloro-phen...)
Show SMILES C[C@H]1OC(=O)[C@@H]2C[C@@H]3CCCC[C@H]3[C@H](\C=C\c3ccc(cn3)-c3cccc(Cl)c3)[C@H]12
Show InChI InChI=1S/C26H28ClNO2/c1-16-25-23(22-8-3-2-5-18(22)14-24(25)26(29)30-16)12-11-21-10-9-19(15-28-21)17-6-4-7-20(27)13-17/h4,6-7,9-13,15-16,18,22-25H,2-3,5,8,14H2,1H3/b12-11+/t16-,18+,22-,23+,24-,25+/m1/s1
n/an/a 10n/an/an/an/an/an/a
Schering-Plough Research Institute
Curated by ChEMBL
Assay Description
In vitro inhibitory concentration aganist human protease activated receptor 1 using [3H]-haTRAP as radioligand
J Med Chem 48: 5884-7 (2005)
Article DOI: 10.1021/jm0502236
BindingDB Entry DOI: 10.7270/Q2V69J5Q