BDBM50173675 5-(3-Bromo-phenyl)-3-phenyl-pyridazine::CHEMBL197302
SMILES: Brc1cccc(c1)-c1cnnc(c1)-c1ccccc1
InChI Key: InChIKey=DWEPHBCGVLXMBR-UHFFFAOYSA-N
Data: 3 KI
Activity Spreadsheet -- Enzyme Inhibition Constant Data from BindingDB
Found 3 hits for monomerid = 50173675
Trg + Lig
Ki
nM
ΔG°
kcal/mole
IC50
nM
Kd
nM
EC50/IC50
nM
koff
s-1
kon
M-1s-1
pHTemp
°C
GABA receptor alpha-1/beta-3/gamma-2 subunit
(Homo sapiens (Human))
BDBM50173675
(5-(3-Bromo-phenyl)-3-phenyl-pyridazine | CHEMBL197...)
Show SMILES Brc1cccc(c1)-c1cnnc(c1)-c1ccccc1
Show InChI InChI=1S/C16H11BrN2/c17-15-8-4-7-13(9-15)14-10-16(19-18-11-14)12-5-2-1-3-6-12/h1-11H
7.5n/an/an/an/an/an/a7.4n/a
Merck Sharp & Dohme Research Laboratories
Curated by ChEMBL
Assay Description
Displacement of [3H]-Ro- 15-1788 binding from human recombinant Gamma-aminobutyric-acid A receptor alpha1-beta3-gamma2 expressed in mouse fibroblast ...
J Med Chem 48: 6004-11 (2005)
Article DOI: 10.1021/jm050249x
BindingDB Entry DOI: 10.7270/Q26H4GZH
GABA receptor alpha-5/beta-3/gamma-2 subunit
(Homo sapiens (Human))
BDBM50173675
(5-(3-Bromo-phenyl)-3-phenyl-pyridazine | CHEMBL197...)
Show SMILES Brc1cccc(c1)-c1cnnc(c1)-c1ccccc1
Show InChI InChI=1S/C16H11BrN2/c17-15-8-4-7-13(9-15)14-10-16(19-18-11-14)12-5-2-1-3-6-12/h1-11H
7.90n/an/an/an/an/an/a7.4n/a
Merck Sharp & Dohme Research Laboratories
Curated by ChEMBL
Assay Description
Displacement of [3H]-Ro- 15-1788 binding from human recombinant Gamma-aminobutyric-acid A receptor alpha5-beta3-gamma2 expressed in mouse fibroblast ...
J Med Chem 48: 6004-11 (2005)
Article DOI: 10.1021/jm050249x
BindingDB Entry DOI: 10.7270/Q26H4GZH
GABA receptor alpha-3/beta-3/gamma-2 subunit
(Homo sapiens (Human))
BDBM50173675
(5-(3-Bromo-phenyl)-3-phenyl-pyridazine | CHEMBL197...)
Show SMILES Brc1cccc(c1)-c1cnnc(c1)-c1ccccc1
Show InChI InChI=1S/C16H11BrN2/c17-15-8-4-7-13(9-15)14-10-16(19-18-11-14)12-5-2-1-3-6-12/h1-11H
15n/an/an/an/an/an/a7.4n/a
Merck Sharp & Dohme Research Laboratories
Curated by ChEMBL
Assay Description
Displacement of [3H]-Ro- 15-1788 binding from human recombinant Gamma-aminobutyric-acid A receptor alpha3-beta3-gamma2 expressed in mouse fibroblast ...
J Med Chem 48: 6004-11 (2005)
Article DOI: 10.1021/jm050249x
BindingDB Entry DOI: 10.7270/Q26H4GZH