BDBM50173831 4-(3-chloro-4-fluorophenylamino)-6-(3-(4-methylpiperazin-1-yl)propylamino)-1,7-naphthyridine-3-carbonitrile::CHEMBL370655
SMILES: CN1CCN(CCCNc2cc3c(Nc4ccc(F)c(Cl)c4)c(cnc3cn2)C#N)CC1
InChI Key: InChIKey=HNDCLVVBDGSSPD-UHFFFAOYSA-N
Data: 1 IC50
Activity Spreadsheet -- Enzyme Inhibition Constant Data from BindingDB
Found 1 hit for monomerid = 50173831
Trg + Lig
Ki
nM
ΔG°
kcal/mole
IC50
nM
Kd
nM
EC50/IC50
nM
koff
s-1
kon
M-1s-1
pHTemp
°C
Mitogen-activated protein kinase kinase kinase 8
(Homo sapiens (Human))
BDBM50173831
(4-(3-chloro-4-fluorophenylamino)-6-(3-(4-methylpip...)
Show SMILES CN1CCN(CCCNc2cc3c(Nc4ccc(F)c(Cl)c4)c(cnc3cn2)C#N)CC1
Show InChI InChI=1S/C23H25ClFN7/c1-31-7-9-32(10-8-31)6-2-5-27-22-12-18-21(15-29-22)28-14-16(13-26)23(18)30-17-3-4-20(25)19(24)11-17/h3-4,11-12,14-15H,2,5-10H2,1H3,(H,27,29)(H,28,30)
NCI pathway
Reactome pathway
n/an/a 2.10E+4n/an/an/an/an/an/a
Wyeth Research
Curated by ChEMBL
Assay Description
Inhibitory activity against human Tpl2 kinase via quantification of MEK phosphorylation
Bioorg Med Chem Lett 15: 5288-92 (2005)
Article DOI: 10.1016/j.bmcl.2005.08.029
BindingDB Entry DOI: 10.7270/Q2JS9Q0M