BDBM50173875 CHEMBL3808756
SMILES: CCCn1c2[nH]nc(-c3nc(C(=O)OC)c(s3)-c3cccnc3)c2ccc1=O
InChI Key: InChIKey=PBOWQRKUMWKGQC-UHFFFAOYSA-N
Data: 1 IC50
Activity Spreadsheet -- Enzyme Inhibition Constant Data from BindingDB
Found 1 hit for monomerid = 50173875
Trg + Lig
Ki
nM
ΔG°
kcal/mole
IC50
nM
Kd
nM
EC50/IC50
nM
koff
s-1
kon
M-1s-1
pHTemp
°C
DNA gyrase
(Staphylococcus aureus)
BDBM50173875
(CHEMBL3808756)
Show SMILES CCCn1c2[nH]nc(-c3nc(C(=O)OC)c(s3)-c3cccnc3)c2ccc1=O
Show InChI InChI=1S/C19H17N5O3S/c1-3-9-24-13(25)7-6-12-14(22-23-17(12)24)18-21-15(19(26)27-2)16(28-18)11-5-4-8-20-10-11/h4-8,10H,3,9H2,1-2H3,(H,22,23)
n/an/a 6n/an/an/an/an/an/a
Cubist Pharmaceuticals, Inc.
Curated by ChEMBL
Assay Description
Inhibition of Staphylococcus aureus DNA gyraseB ATPase activity using linear pBR322 DNA substrate incubated for 30 mins by fluorescence polarization ...
ACS Med Chem Lett 7: 374-8 (2016)
BindingDB Entry DOI: 10.7270/Q20R9RB6