BDBM50174199 CHEMBL198909::H-Dmt-Tic-NH-(CH2)6-NH-Phe-H
SMILES: Cc1cc(O)cc(C)c1C[C@H](N)C(=O)N1Cc2ccccc2CC1C(=O)NCCCCCCNC(=O)[C@@H](N)Cc1ccccc1
InChI Key: InChIKey=VWEMLWZEBKVSHE-KOPQTXDBSA-N
Data: 2 KI  2 IC50
Activity Spreadsheet -- Enzyme Inhibition Constant Data from BindingDB
Found 4 hits for monomerid = 50174199
Trg + Lig
Ki
nM
ΔG°
kcal/mole
IC50
nM
Kd
nM
EC50/IC50
nM
koff
s-1
kon
M-1s-1
pHTemp
°C
Opioid receptors; mu & delta
(Rattus norvegicus (rat))
BDBM50174199
(CHEMBL198909 | H-Dmt-Tic-NH-(CH2)6-NH-Phe-H)
Show SMILES Cc1cc(O)cc(C)c1C[C@H](N)C(=O)N1Cc2ccccc2CC1C(=O)NCCCCCCNC(=O)[C@@H](N)Cc1ccccc1
Show InChI InChI=1S/C36H47N5O4/c1-24-18-29(42)19-25(2)30(24)22-32(38)36(45)41-23-28-15-9-8-14-27(28)21-33(41)35(44)40-17-11-4-3-10-16-39-34(43)31(37)20-26-12-6-5-7-13-26/h5-9,12-15,18-19,31-33,42H,3-4,10-11,16-17,20-23,37-38H2,1-2H3,(H,39,43)(H,40,44)/t31-,32-,33?/m0/s1
Reactome pathway
0.890n/an/an/an/an/an/an/an/a
Kobe Gakuin University
Curated by ChEMBL
Assay Description
Displacement of [3H]deltorphin II from delta opioid receptor in rat brain membrane
Bioorg Med Chem Lett 15: 5517-20 (2005)
Article DOI: 10.1016/j.bmcl.2005.08.073
BindingDB Entry DOI: 10.7270/Q2MK6CFQ
Mu-type opioid receptor
(Rattus norvegicus (rat))
BDBM50174199
(CHEMBL198909 | H-Dmt-Tic-NH-(CH2)6-NH-Phe-H)
Show SMILES Cc1cc(O)cc(C)c1C[C@H](N)C(=O)N1Cc2ccccc2CC1C(=O)NCCCCCCNC(=O)[C@@H](N)Cc1ccccc1
Show InChI InChI=1S/C36H47N5O4/c1-24-18-29(42)19-25(2)30(24)22-32(38)36(45)41-23-28-15-9-8-14-27(28)21-33(41)35(44)40-17-11-4-3-10-16-39-34(43)31(37)20-26-12-6-5-7-13-26/h5-9,12-15,18-19,31-33,42H,3-4,10-11,16-17,20-23,37-38H2,1-2H3,(H,39,43)(H,40,44)/t31-,32-,33?/m0/s1
Reactome pathway
1.91n/an/an/an/an/an/an/an/a
Kobe Gakuin University
Curated by ChEMBL
Assay Description
Displacement of [3H]DAMGO from mu opioid receptor in rat brain membrane
Bioorg Med Chem Lett 15: 5517-20 (2005)
Article DOI: 10.1016/j.bmcl.2005.08.073
BindingDB Entry DOI: 10.7270/Q2MK6CFQ
Mu-type opioid receptor
(GUINEA PIG)
BDBM50174199
(CHEMBL198909 | H-Dmt-Tic-NH-(CH2)6-NH-Phe-H)
Show SMILES Cc1cc(O)cc(C)c1C[C@H](N)C(=O)N1Cc2ccccc2CC1C(=O)NCCCCCCNC(=O)[C@@H](N)Cc1ccccc1
Show InChI InChI=1S/C36H47N5O4/c1-24-18-29(42)19-25(2)30(24)22-32(38)36(45)41-23-28-15-9-8-14-27(28)21-33(41)35(44)40-17-11-4-3-10-16-39-34(43)31(37)20-26-12-6-5-7-13-26/h5-9,12-15,18-19,31-33,42H,3-4,10-11,16-17,20-23,37-38H2,1-2H3,(H,39,43)(H,40,44)/t31-,32-,33?/m0/s1
n/an/a 5.55E+3n/an/an/an/an/an/a
Kobe Gakuin University
Curated by ChEMBL
Assay Description
Agonistic activity against mu opioid receptor in guinea-pig ileum
Bioorg Med Chem Lett 15: 5517-20 (2005)
Article DOI: 10.1016/j.bmcl.2005.08.073
BindingDB Entry DOI: 10.7270/Q2MK6CFQ
Delta-type opioid receptor
(MOUSE)
BDBM50174199
(CHEMBL198909 | H-Dmt-Tic-NH-(CH2)6-NH-Phe-H)
Show SMILES Cc1cc(O)cc(C)c1C[C@H](N)C(=O)N1Cc2ccccc2CC1C(=O)NCCCCCCNC(=O)[C@@H](N)Cc1ccccc1
Show InChI InChI=1S/C36H47N5O4/c1-24-18-29(42)19-25(2)30(24)22-32(38)36(45)41-23-28-15-9-8-14-27(28)21-33(41)35(44)40-17-11-4-3-10-16-39-34(43)31(37)20-26-12-6-5-7-13-26/h5-9,12-15,18-19,31-33,42H,3-4,10-11,16-17,20-23,37-38H2,1-2H3,(H,39,43)(H,40,44)/t31-,32-,33?/m0/s1
Reactome pathway
n/an/a>1.00E+4n/an/an/an/an/an/a
Kobe Gakuin University
Curated by ChEMBL
Assay Description
Agonistic activity at delta opioid receptor in mouse vas deferens
Bioorg Med Chem Lett 15: 5517-20 (2005)
Article DOI: 10.1016/j.bmcl.2005.08.073
BindingDB Entry DOI: 10.7270/Q2MK6CFQ