BDBM50174351 CHEMBL196707::[5-Fluoro-1-(4-methanesulfonyl-benzenesulfonyl)-2-methyl-1H-indol-3-yl]-acetic acid
SMILES: Cc1c(CC(O)=O)c2cc(F)ccc2n1S(=O)(=O)c1ccc(cc1)S(C)(=O)=O
InChI Key: InChIKey=HKLGBZGYRPIFOH-UHFFFAOYSA-N
Data: 3 KI  4 IC50
Activity Spreadsheet -- Enzyme Inhibition Constant Data from BindingDB
Found 7 hits for monomerid = 50174351
Trg + Lig
Ki
nM
ΔG°
kcal/mole
IC50
nM
Kd
nM
EC50/IC50
nM
koff
s-1
kon
M-1s-1
pHTemp
°C
G protein-coupled receptor 44
(Homo sapiens (Human))
BDBM50174351
(CHEMBL196707 | [5-Fluoro-1-(4-methanesulfonyl-benz...)
Show SMILES Cc1c(CC(O)=O)c2cc(F)ccc2n1S(=O)(=O)c1ccc(cc1)S(C)(=O)=O
Show InChI InChI=1S/C18H16FNO6S2/c1-11-15(10-18(21)22)16-9-12(19)3-8-17(16)20(11)28(25,26)14-6-4-13(5-7-14)27(2,23)24/h3-9H,10H2,1-2H3,(H,21,22)
Reactome pathway
68n/an/an/an/an/an/an/an/a
Oxagen Ltd.
Curated by ChEMBL
Assay Description
Binding affinity towards human CRTH2 receptor expressed in CHO cells
J Med Chem 48: 6174-7 (2005)
Article DOI: 10.1021/jm050519b
BindingDB Entry DOI: 10.7270/Q2KK9B9B
G protein-coupled receptor 44
(Homo sapiens (Human))
BDBM50174351
(CHEMBL196707 | [5-Fluoro-1-(4-methanesulfonyl-benz...)
Show SMILES Cc1c(CC(O)=O)c2cc(F)ccc2n1S(=O)(=O)c1ccc(cc1)S(C)(=O)=O
Show InChI InChI=1S/C18H16FNO6S2/c1-11-15(10-18(21)22)16-9-12(19)3-8-17(16)20(11)28(25,26)14-6-4-13(5-7-14)27(2,23)24/h3-9H,10H2,1-2H3,(H,21,22)
Reactome pathway
68n/an/an/an/an/an/an/an/a
Oxagen Ltd.
Curated by ChEMBL
Assay Description
Antagonistic activity at CRTH2 in human eosinophils assessed as inhibition of PGD2-induced calcium mobilization after 60 mins by Fluo-3 based fluores...
J Med Chem 55: 2915-31 (2012)
Article DOI: 10.1021/jm2013997
BindingDB Entry DOI: 10.7270/Q2Z0398R
Prostanoid DP receptor
(Homo sapiens (Human))
BDBM50174351
(CHEMBL196707 | [5-Fluoro-1-(4-methanesulfonyl-benz...)
Show SMILES Cc1c(CC(O)=O)c2cc(F)ccc2n1S(=O)(=O)c1ccc(cc1)S(C)(=O)=O
Show InChI InChI=1S/C18H16FNO6S2/c1-11-15(10-18(21)22)16-9-12(19)3-8-17(16)20(11)28(25,26)14-6-4-13(5-7-14)27(2,23)24/h3-9H,10H2,1-2H3,(H,21,22)
>1.00E+4n/an/an/an/an/an/an/an/a
Oxagen Ltd.
Curated by ChEMBL
Assay Description
Binding affinity towards human DP receptor expressed in CHO cells
J Med Chem 48: 6174-7 (2005)
Article DOI: 10.1021/jm050519b
BindingDB Entry DOI: 10.7270/Q2KK9B9B
G protein-coupled receptor 44
(Homo sapiens (Human))
BDBM50174351
(CHEMBL196707 | [5-Fluoro-1-(4-methanesulfonyl-benz...)
Show SMILES Cc1c(CC(O)=O)c2cc(F)ccc2n1S(=O)(=O)c1ccc(cc1)S(C)(=O)=O
Show InChI InChI=1S/C18H16FNO6S2/c1-11-15(10-18(21)22)16-9-12(19)3-8-17(16)20(11)28(25,26)14-6-4-13(5-7-14)27(2,23)24/h3-9H,10H2,1-2H3,(H,21,22)
Reactome pathway
n/an/a 67n/an/an/an/an/an/a
Oxagen Ltd.
Curated by ChEMBL
Assay Description
Concentration required to inhibit PGD-2 induced chemotaxis of Th2 cells expressing CRTH2
J Med Chem 48: 6174-7 (2005)
Article DOI: 10.1021/jm050519b
BindingDB Entry DOI: 10.7270/Q2KK9B9B
G protein-coupled receptor 44
(Homo sapiens (Human))
BDBM50174351
(CHEMBL196707 | [5-Fluoro-1-(4-methanesulfonyl-benz...)
Show SMILES Cc1c(CC(O)=O)c2cc(F)ccc2n1S(=O)(=O)c1ccc(cc1)S(C)(=O)=O
Show InChI InChI=1S/C18H16FNO6S2/c1-11-15(10-18(21)22)16-9-12(19)3-8-17(16)20(11)28(25,26)14-6-4-13(5-7-14)27(2,23)24/h3-9H,10H2,1-2H3,(H,21,22)
Reactome pathway
n/an/a 106n/an/an/an/an/an/a
Oxagen Ltd.
Curated by ChEMBL
Assay Description
Inhibition of CRTH2 in human whole blood
J Med Chem 55: 2915-31 (2012)
Article DOI: 10.1021/jm2013997
BindingDB Entry DOI: 10.7270/Q2Z0398R
G protein-coupled receptor 44
(Homo sapiens (Human))
BDBM50174351
(CHEMBL196707 | [5-Fluoro-1-(4-methanesulfonyl-benz...)
Show SMILES Cc1c(CC(O)=O)c2cc(F)ccc2n1S(=O)(=O)c1ccc(cc1)S(C)(=O)=O
Show InChI InChI=1S/C18H16FNO6S2/c1-11-15(10-18(21)22)16-9-12(19)3-8-17(16)20(11)28(25,26)14-6-4-13(5-7-14)27(2,23)24/h3-9H,10H2,1-2H3,(H,21,22)
Reactome pathway
n/an/a 158n/an/an/an/an/an/a
Oxagen Ltd.
Curated by ChEMBL
Assay Description
Concentration required to inhibit PGD-2 (10 nM) stimulated [Ca2+] flux in CHO cells expressing human CRTH2 receptor
J Med Chem 48: 6174-7 (2005)
Article DOI: 10.1021/jm050519b
BindingDB Entry DOI: 10.7270/Q2KK9B9B
G protein-coupled receptor 44
(Homo sapiens (Human))
BDBM50174351
(CHEMBL196707 | [5-Fluoro-1-(4-methanesulfonyl-benz...)
Show SMILES Cc1c(CC(O)=O)c2cc(F)ccc2n1S(=O)(=O)c1ccc(cc1)S(C)(=O)=O
Show InChI InChI=1S/C18H16FNO6S2/c1-11-15(10-18(21)22)16-9-12(19)3-8-17(16)20(11)28(25,26)14-6-4-13(5-7-14)27(2,23)24/h3-9H,10H2,1-2H3,(H,21,22)
Reactome pathway
n/an/a 74n/an/an/an/an/an/a
Oxagen Ltd.
Curated by ChEMBL
Assay Description
Concentration required to inhibit PGD-2 induced change in the shape of human eosinophils expressing CRTH2
J Med Chem 48: 6174-7 (2005)
Article DOI: 10.1021/jm050519b
BindingDB Entry DOI: 10.7270/Q2KK9B9B