BDBM50174358 (1-Benzenesulfonyl-5-fluoro-2-methyl-1H-indol-3-yl)-acetic acid::CHEMBL197398
SMILES: Cc1c(CC(O)=O)c2cc(F)ccc2n1S(=O)(=O)c1ccccc1
InChI Key: InChIKey=KUSDXXPMRBUTNN-UHFFFAOYSA-N
Data: 2 KI  1 IC50
Activity Spreadsheet -- Enzyme Inhibition Constant Data from BindingDB
Found 3 hits for monomerid = 50174358
Trg + Lig
Ki
nM
ΔG°
kcal/mole
IC50
nM
Kd
nM
EC50/IC50
nM
koff
s-1
kon
M-1s-1
pHTemp
°C
Prostaglandin D2 receptor 2
(Homo sapiens (Human))
BDBM50174358
((1-Benzenesulfonyl-5-fluoro-2-methyl-1H-indol-3-yl...)
Show SMILES Cc1c(CC(O)=O)c2cc(F)ccc2n1S(=O)(=O)c1ccccc1
Show InChI InChI=1S/C17H14FNO4S/c1-11-14(10-17(20)21)15-9-12(18)7-8-16(15)19(11)24(22,23)13-5-3-2-4-6-13/h2-9H,10H2,1H3,(H,20,21)
Reactome pathway
250n/an/an/an/an/an/an/an/a
Oxagen Ltd.
Curated by ChEMBL
Assay Description
Binding affinity towards human CRTH2 receptor expressed in CHO cells
J Med Chem 48: 6174-7 (2005)
Article DOI: 10.1021/jm050519b
BindingDB Entry DOI: 10.7270/Q2KK9B9B
Prostaglandin D2 receptor
(Homo sapiens (Human))
BDBM50174358
((1-Benzenesulfonyl-5-fluoro-2-methyl-1H-indol-3-yl...)
Show SMILES Cc1c(CC(O)=O)c2cc(F)ccc2n1S(=O)(=O)c1ccccc1
Show InChI InChI=1S/C17H14FNO4S/c1-11-14(10-17(20)21)15-9-12(18)7-8-16(15)19(11)24(22,23)13-5-3-2-4-6-13/h2-9H,10H2,1H3,(H,20,21)
4.86E+3n/an/an/an/an/an/an/an/a
Oxagen Ltd.
Curated by ChEMBL
Assay Description
Binding affinity towards human DP receptor expressed in CHO cells
J Med Chem 48: 6174-7 (2005)
Article DOI: 10.1021/jm050519b
BindingDB Entry DOI: 10.7270/Q2KK9B9B
Prostaglandin D2 receptor 2
(Homo sapiens (Human))
BDBM50174358
((1-Benzenesulfonyl-5-fluoro-2-methyl-1H-indol-3-yl...)
Show SMILES Cc1c(CC(O)=O)c2cc(F)ccc2n1S(=O)(=O)c1ccccc1
Show InChI InChI=1S/C17H14FNO4S/c1-11-14(10-17(20)21)15-9-12(18)7-8-16(15)19(11)24(22,23)13-5-3-2-4-6-13/h2-9H,10H2,1H3,(H,20,21)
Reactome pathway
n/an/a 987n/an/an/an/an/an/a
Oxagen Ltd.
Curated by ChEMBL
Assay Description
Concentration required to inhibit PGD-2 (10 nM) stimulated [Ca2+] flux in CHO cells expressing human CRTH2 receptor
J Med Chem 48: 6174-7 (2005)
Article DOI: 10.1021/jm050519b
BindingDB Entry DOI: 10.7270/Q2KK9B9B