BDBM50174664 1-Pentadecyl-piperidin-4-ylamine; dihydrochloride::CHEMBL535379
SMILES: CCCCCCCCCCCCCCCN1CCC(N)CC1
InChI Key: InChIKey=LMUVHYTUMZFBEH-UHFFFAOYSA-N
Data: 3 EC50
Activity Spreadsheet -- Enzyme Inhibition Constant Data from BindingDB
Found 3 hits for monomerid = 50174664
Trg + Lig
Ki
nM
ΔG°
kcal/mole
IC50
nM
Kd
nM
EC50/IC50
nM
koff
s-1
kon
M-1s-1
pHTemp
°C
Guanine nucleotide-binding protein G(i), alpha-1 subunit
(Homo sapiens (Human))
BDBM50174664
(1-Pentadecyl-piperidin-4-ylamine; dihydrochloride ...)
Show SMILES CCCCCCCCCCCCCCCN1CCC(N)CC1
Show InChI InChI=1S/C20H42N2/c1-2-3-4-5-6-7-8-9-10-11-12-13-14-17-22-18-15-20(21)16-19-22/h20H,2-19,21H2,1H3
NCI pathway
Reactome pathway
n/an/an/an/a 2.21E+4n/an/an/an/a
Universit£ di Firenze
Curated by ChEMBL
Assay Description
Concentration required to stimulate binding of [35S]GTP-gamma-S, with G alpha i1
J Med Chem 48: 6491-503 (2005)
Article DOI: 10.1021/jm050498l
BindingDB Entry DOI: 10.7270/Q2X34Z78
Guanine nucleotide-binding protein G(o), alpha subunit 1
(Homo sapiens (Human))
BDBM50174664
(1-Pentadecyl-piperidin-4-ylamine; dihydrochloride ...)
Show SMILES CCCCCCCCCCCCCCCN1CCC(N)CC1
Show InChI InChI=1S/C20H42N2/c1-2-3-4-5-6-7-8-9-10-11-12-13-14-17-22-18-15-20(21)16-19-22/h20H,2-19,21H2,1H3
NCI pathway
Reactome pathway
n/an/an/an/a 2.30E+4n/an/an/an/a
Universit£ di Firenze
Curated by ChEMBL
Assay Description
Concentration required to stimulate binding of [35S]GTP-gamma-S, with G alpha o1
J Med Chem 48: 6491-503 (2005)
Article DOI: 10.1021/jm050498l
BindingDB Entry DOI: 10.7270/Q2X34Z78
Guanine nucleotide-binding protein G(k), alpha-3 subunit
(Homo sapiens (Human))
BDBM50174664
(1-Pentadecyl-piperidin-4-ylamine; dihydrochloride ...)
Show SMILES CCCCCCCCCCCCCCCN1CCC(N)CC1
Show InChI InChI=1S/C20H42N2/c1-2-3-4-5-6-7-8-9-10-11-12-13-14-17-22-18-15-20(21)16-19-22/h20H,2-19,21H2,1H3
NCI pathway
Reactome pathway
n/an/an/an/a 2.76E+4n/an/an/an/a
Universit£ di Firenze
Curated by ChEMBL
Assay Description
Concentration required to stimulate binding of [35S]GTP-gamma-S, with G alpha i3
J Med Chem 48: 6491-503 (2005)
Article DOI: 10.1021/jm050498l
BindingDB Entry DOI: 10.7270/Q2X34Z78