BDBM50174697 3-fluoro-N-[5-(7-methoxy-10,11-dihydro-5-oxa-2,4,11-triaza-dibenzo[a,d]cyclohepten-1-ylamino)-pyrimidin-2-yl]-benzamide::CHEMBL371270
SMILES: COc1ccc2CNc3c(Nc4cnc(NC(=O)c5cccc(F)c5)nc4)ncnc3Oc2c1
InChI Key: InChIKey=NTWKVWULCGAPRC-UHFFFAOYSA-N
Data: 1 IC50
Activity Spreadsheet -- Enzyme Inhibition Constant Data from BindingDB
Found 1 hit for monomerid = 50174697
Trg + Lig
Ki
nM
ΔG°
kcal/mole
IC50
nM
Kd
nM
EC50/IC50
nM
koff
s-1
kon
M-1s-1
pHTemp
°C
Aurora kinase A
(Homo sapiens (Human))
BDBM50174697
(3-fluoro-N-[5-(7-methoxy-10,11-dihydro-5-oxa-2,4,1...)
Show SMILES COc1ccc2CNc3c(Nc4cnc(NC(=O)c5cccc(F)c5)nc4)ncnc3Oc2c1
Show InChI InChI=1S/C23H18FN7O3/c1-33-17-6-5-14-9-25-19-20(28-12-29-22(19)34-18(14)8-17)30-16-10-26-23(27-11-16)31-21(32)13-3-2-4-15(24)7-13/h2-8,10-12,25H,9H2,1H3,(H,28,29,30)(H,26,27,31,32)
NCI pathway
Reactome pathway
n/an/a 320n/an/an/an/an/an/a
ImClone Systems Inc
Curated by ChEMBL
Assay Description
Inhibitory activity against Aurora A kinase
Bioorg Med Chem Lett 15: 5474-7 (2005)
Article DOI: 10.1016/j.bmcl.2005.08.098
BindingDB Entry DOI: 10.7270/Q2S46RGS