BDBM50174738 CHEMBL3808947
SMILES: CCCN(C1CCN(CC1)c1ncnc2sc(C)c(C)c12)c1ccc(C)nc1
InChI Key: InChIKey=AKFSSALXUGYCFR-UHFFFAOYSA-N
Data: 1 IC50
Activity Spreadsheet -- Enzyme Inhibition Constant Data from BindingDB
Found 1 hit for monomerid = 50174738
Trg + Lig
Ki
nM
ΔG°
kcal/mole
IC50
nM
Kd
nM
EC50/IC50
nM
koff
s-1
kon
M-1s-1
pHTemp
°C
Muscarinic acetylcholine receptor M4
(Homo sapiens (Human))
BDBM50174738
(CHEMBL3808947)
Show SMILES CCCN(C1CCN(CC1)c1ncnc2sc(C)c(C)c12)c1ccc(C)nc1
Show InChI InChI=1S/C22H29N5S/c1-5-10-27(19-7-6-15(2)23-13-19)18-8-11-26(12-9-18)21-20-16(3)17(4)28-22(20)25-14-24-21/h6-7,13-14,18H,5,8-12H2,1-4H3
Reactome pathway
n/an/a 2.40E+3n/an/an/an/an/an/a
Vanderbilt University Medical Center
Curated by ChEMBL
Assay Description
Antagonist activity at human M4 receptor expressed in CHO cells coexpressing Gqi5 by calcium mobilization assay
Bioorg Med Chem Lett 26: 3029-33 (2016)
BindingDB Entry DOI: 10.7270/Q2DV1MTJ