BDBM50174835 4'-(4-toluenesulfonamido)-4-hydroxychalcone::4'-(p-Toluenesulfonamide)-4-hydroxychalcone::CHEMBL371723::N-(4-(3-(4-hydroxyphenyl)acryloyl)phenyl)-4-methylbenzenesulfonamide::Sulfonamide chalcone, 4
SMILES: Cc1ccc(cc1)S(=O)(=O)Nc1ccc(cc1)C(=O)\C=C\c1ccc(O)cc1
InChI Key: InChIKey=KDODYFOOJCIHGK-GIDUJCDVSA-N
Data: 1 KI  5 IC50
Activity Spreadsheet -- Enzyme Inhibition Constant Data from BindingDB
Found 6 hits for monomerid = 50174835
Trg + Lig
Ki
nM
ΔG°
kcal/mole
IC50
nM
Kd
nM
EC50/IC50
nM
koff
s-1
kon
M-1s-1
pHTemp
°C
Tyrosinase
(Agaricus bisporus (Common mushroom))
BDBM50174835
(4'-(4-toluenesulfonamido)-4-hydroxychalcone | 4'-(...)
Show SMILES Cc1ccc(cc1)S(=O)(=O)Nc1ccc(cc1)C(=O)\C=C\c1ccc(O)cc1
Show InChI InChI=1S/C22H19NO4S/c1-16-2-13-21(14-3-16)28(26,27)23-19-9-7-18(8-10-19)22(25)15-6-17-4-11-20(24)12-5-17/h2-15,23-24H,1H3/b15-6+
1.26E+4n/an/an/an/an/an/an/an/a
Department of Functional Crop
Curated by ChEMBL
Assay Description
Competitive inhibition of monophenolase activity of mushroom tyrosinase using as L-tyrosine substrate by Lineweaver-Burk plot analysis
Eur J Med Chem 45: 2010-7 (2010)
Article DOI: 10.1016/j.ejmech.2010.01.049
BindingDB Entry DOI: 10.7270/Q2H70FZM
Tyrosinase
(Agaricus bisporus (Common mushroom))
BDBM50174835
(4'-(4-toluenesulfonamido)-4-hydroxychalcone | 4'-(...)
Show SMILES Cc1ccc(cc1)S(=O)(=O)Nc1ccc(cc1)C(=O)\C=C\c1ccc(O)cc1
Show InChI InChI=1S/C22H19NO4S/c1-16-2-13-21(14-3-16)28(26,27)23-19-9-7-18(8-10-19)22(25)15-6-17-4-11-20(24)12-5-17/h2-15,23-24H,1H3/b15-6+
n/an/a 2.33E+4n/an/an/an/an/an/a
Department of Functional Crop
Curated by ChEMBL
Assay Description
Inhibition of monophenolase activity of mushroom tyrosinase using as L-tyrosine substrate by spectrophotometric analysis
Eur J Med Chem 45: 2010-7 (2010)
Article DOI: 10.1016/j.ejmech.2010.01.049
BindingDB Entry DOI: 10.7270/Q2H70FZM
Potassium channel subfamily K member 10
(Rattus norvegicus)
BDBM50174835
(4'-(4-toluenesulfonamido)-4-hydroxychalcone | 4'-(...)
Show SMILES Cc1ccc(cc1)S(=O)(=O)Nc1ccc(cc1)C(=O)\C=C\c1ccc(O)cc1
Show InChI InChI=1S/C22H19NO4S/c1-16-2-13-21(14-3-16)28(26,27)23-19-9-7-18(8-10-19)22(25)15-6-17-4-11-20(24)12-5-17/h2-15,23-24H,1H3/b15-6+
n/an/a 6.20E+4n/an/an/an/an/an/a
Gyeongsang National University
Curated by ChEMBL
Assay Description
Inhibition of rat TREK2 channel -mediated current expressed in HEK293 at 60 mV holding potential by patch clamp method
Bioorg Med Chem Lett 20: 4237-9 (2010)
Article DOI: 10.1016/j.bmcl.2010.05.033
BindingDB Entry DOI: 10.7270/Q25Q4ZXM
Beta-amylase
(Hordeum vulgare)
BDBM50174835
(4'-(4-toluenesulfonamido)-4-hydroxychalcone | 4'-(...)
Show SMILES Cc1ccc(cc1)S(=O)(=O)Nc1ccc(cc1)C(=O)\C=C\c1ccc(O)cc1
Show InChI InChI=1S/C22H19NO4S/c1-16-2-13-21(14-3-16)28(26,27)23-19-9-7-18(8-10-19)22(25)15-6-17-4-11-20(24)12-5-17/h2-15,23-24H,1H3/b15-6+
n/an/a 2.47E+5n/an/an/an/an/an/a
Gyeongsang National University
Curated by ChEMBL
Assay Description
Inhibitory activity against barley beta amylase
Bioorg Med Chem Lett 15: 5514-6 (2005)
Article DOI: 10.1016/j.bmcl.2005.08.087
BindingDB Entry DOI: 10.7270/Q2FX7B6F
Alpha-amylase
(Bacillus licheniformis)
BDBM50174835
(4'-(4-toluenesulfonamido)-4-hydroxychalcone | 4'-(...)
Show SMILES Cc1ccc(cc1)S(=O)(=O)Nc1ccc(cc1)C(=O)\C=C\c1ccc(O)cc1
Show InChI InChI=1S/C22H19NO4S/c1-16-2-13-21(14-3-16)28(26,27)23-19-9-7-18(8-10-19)22(25)15-6-17-4-11-20(24)12-5-17/h2-15,23-24H,1H3/b15-6+
n/an/a 8.78E+4n/an/an/an/an/an/a
Gyeongsang National University
Curated by ChEMBL
Assay Description
Inhibitory activity against Bacillus licheniformis alpha amylase
Bioorg Med Chem Lett 15: 5514-6 (2005)
Article DOI: 10.1016/j.bmcl.2005.08.087
BindingDB Entry DOI: 10.7270/Q2FX7B6F
Trans-sialidase
(Trypanosoma cruzi)
BDBM50174835
(4'-(4-toluenesulfonamido)-4-hydroxychalcone | 4'-(...)
Show SMILES Cc1ccc(cc1)S(=O)(=O)Nc1ccc(cc1)C(=O)\C=C\c1ccc(O)cc1
Show InChI InChI=1S/C22H19NO4S/c1-16-2-13-21(14-3-16)28(26,27)23-19-9-7-18(8-10-19)22(25)15-6-17-4-11-20(24)12-5-17/h2-15,23-24H,1H3/b15-6+
n/an/a 7.30E+4n/an/an/an/a7.635
University of British Columbia
Assay Description
Inhibition assay using trans-sialidase, a membrane-associated protein.
Chembiochem 10: 2475-9 (2009)
Article DOI: 10.1002/cbic.200900108
BindingDB Entry DOI: 10.7270/Q2MG7N10