null
SMILES: CCCS(=O)(=O)Nc1ccc2O[C@@H](CCc2c1)C(=O)N(C)[C@H](CN1CC[C@H](O)C1)c1ccccc1
InChI Key: InChIKey=CFVDZEBIIWCJDD-ARNLJNQMSA-N
Activity Spreadsheet -- Enzyme Inhibition Constant Data from BindingDB
Found 3 hits for monomerid = 50174952
Trg + Lig
Ki
nM
ΔG°
kcal/mole
IC50
nM
Kd
nM
EC50/IC50
nM
koff
s-1
kon
M-1s-1
pHTemp
°C
Kappa-type opioid receptor
(Homo sapiens (Human))
BDBM50174952
((S)-N-((S)-2-((S)-3-hydroxypyrrolidin-1-yl)-1-phen...)
Show SMILES CCCS(=O)(=O)Nc1ccc2O[C@@H](CCc2c1)C(=O)N(C)[C@H](CN1CC[C@H](O)C1)c1ccccc1
Show InChI InChI=1S/C26H35N3O5S/c1-3-15-35(32,33)27-21-10-12-24-20(16-21)9-11-25(34-24)26(31)28(2)23(19-7-5-4-6-8-19)18-29-14-13-22(30)17-29/h4-8,10,12,16,22-23,25,27,30H,3,9,11,13-15,17-18H2,1-2H3/t22-,23+,25-/m0/s1
Reactome pathway
14n/an/an/an/an/an/an/an/a
Adolor Corporation
Curated by ChEMBL
Assay Description
Agonistic activity at kappa opioid receptor
Bioorg Med Chem Lett 15: 5114-9 (2005)
Article DOI: 10.1016/j.bmcl.2005.08.094
BindingDB Entry DOI: 10.7270/Q23F4P6H
Mu-type opioid receptor
(Homo sapiens (Human))
BDBM50174952
((S)-N-((S)-2-((S)-3-hydroxypyrrolidin-1-yl)-1-phen...)
Show SMILES CCCS(=O)(=O)Nc1ccc2O[C@@H](CCc2c1)C(=O)N(C)[C@H](CN1CC[C@H](O)C1)c1ccccc1
Show InChI InChI=1S/C26H35N3O5S/c1-3-15-35(32,33)27-21-10-12-24-20(16-21)9-11-25(34-24)26(31)28(2)23(19-7-5-4-6-8-19)18-29-14-13-22(30)17-29/h4-8,10,12,16,22-23,25,27,30H,3,9,11,13-15,17-18H2,1-2H3/t22-,23+,25-/m0/s1
NCI pathway
Reactome pathway
>5.00E+3n/an/an/an/an/an/an/an/a
Adolor Corporation
Curated by ChEMBL
Assay Description
Agonistic activity at mu opioid receptor
Bioorg Med Chem Lett 15: 5114-9 (2005)
Article DOI: 10.1016/j.bmcl.2005.08.094
BindingDB Entry DOI: 10.7270/Q23F4P6H
Cytochrome P450 2D6
(Homo sapiens (Human))
BDBM50174952
((S)-N-((S)-2-((S)-3-hydroxypyrrolidin-1-yl)-1-phen...)
Show SMILES CCCS(=O)(=O)Nc1ccc2O[C@@H](CCc2c1)C(=O)N(C)[C@H](CN1CC[C@H](O)C1)c1ccccc1
Show InChI InChI=1S/C26H35N3O5S/c1-3-15-35(32,33)27-21-10-12-24-20(16-21)9-11-25(34-24)26(31)28(2)23(19-7-5-4-6-8-19)18-29-14-13-22(30)17-29/h4-8,10,12,16,22-23,25,27,30H,3,9,11,13-15,17-18H2,1-2H3/t22-,23+,25-/m0/s1
n/an/a 9.50E+3n/an/an/an/an/an/a
Adolor Corporation
Curated by ChEMBL
Assay Description
Inhibitory activity against CYP2D6
Bioorg Med Chem Lett 15: 5114-9 (2005)
Article DOI: 10.1016/j.bmcl.2005.08.094
BindingDB Entry DOI: 10.7270/Q23F4P6H