BDBM50175076 (S,Z)-2-(4-methoxybenzoyl)-3-(2-methylbenzofuran-5-ylamino)-3-(2-oxo-1-(2-oxo-2-(pyrrolidin-1-yl)ethyl)azepan-3-ylamino)acrylonitrile::CHEMBL382091
SMILES: COc1ccc(cc1)C(=O)C(C#N)C(N[C@H]1CCCCN(CC(=O)N2CCCC2)C1=O)=Nc1ccc2oc(C)cc2c1
InChI Key: InChIKey=CPGKSDHAQRBDLY-GEVKEYJPSA-N
Data: 1 IC50
Activity Spreadsheet -- Enzyme Inhibition Constant Data from BindingDB
Found 1 hit for monomerid = 50175076
Trg + Lig
Ki
nM
ΔG°
kcal/mole
IC50
nM
Kd
nM
EC50/IC50
nM
koff
s-1
kon
M-1s-1
pHTemp
°C
Coagulation factor X
(Homo sapiens (Human))
BDBM50175076
((S,Z)-2-(4-methoxybenzoyl)-3-(2-methylbenzofuran-5...)
Show SMILES COc1ccc(cc1)C(=O)C(C#N)C(N[C@H]1CCCCN(CC(=O)N2CCCC2)C1=O)=Nc1ccc2oc(C)cc2c1 |w:31.34|
Show InChI InChI=1S/C32H35N5O5/c1-21-17-23-18-24(10-13-28(23)42-21)34-31(26(19-33)30(39)22-8-11-25(41-2)12-9-22)35-27-7-3-4-16-37(32(27)40)20-29(38)36-14-5-6-15-36/h8-13,17-18,26-27H,3-7,14-16,20H2,1-2H3,(H,34,35)/t26?,27-/m0/s1
Reactome pathway
n/an/a 13n/an/an/an/an/an/a
Bristol-Myers Squibb Pharmaceutical Research Institute
Curated by ChEMBL
Assay Description
Inhibitory activity against human FXa
Bioorg Med Chem Lett 15: 5453-8 (2005)
Article DOI: 10.1016/j.bmcl.2005.08.107
BindingDB Entry DOI: 10.7270/Q2KH0MW5