BDBM50175080 (S,Z)-3-(2-methylbenzofuran-5-ylamino)-2-(methylsulfonyl)-3-(2-oxo-1-(2-oxo-2-(pyrrolidin-1-yl)ethyl)azepan-3-ylamino)acrylonitrile::CHEMBL197426
SMILES: Cc1cc2cc(ccc2o1)N=C(N[C@H]1CCCCN(CC(=O)N2CCCC2)C1=O)C(C#N)S(C)(=O)=O
InChI Key: InChIKey=DUAIKWFMGAGDJJ-AIBWNMTMSA-N
Data: 1 IC50
Activity Spreadsheet -- Enzyme Inhibition Constant Data from BindingDB
Found 1 hit for monomerid = 50175080
Trg + Lig
Ki
nM
ΔG°
kcal/mole
IC50
nM
Kd
nM
EC50/IC50
nM
koff
s-1
kon
M-1s-1
pHTemp
°C
Coagulation factor X
(Homo sapiens (Human))
BDBM50175080
((S,Z)-3-(2-methylbenzofuran-5-ylamino)-2-(methylsu...)
Show SMILES Cc1cc2cc(ccc2o1)N=C(N[C@H]1CCCCN(CC(=O)N2CCCC2)C1=O)C(C#N)S(C)(=O)=O |w:10.11|
Show InChI InChI=1S/C25H31N5O5S/c1-17-13-18-14-19(8-9-21(18)35-17)27-24(22(15-26)36(2,33)34)28-20-7-3-4-12-30(25(20)32)16-23(31)29-10-5-6-11-29/h8-9,13-14,20,22H,3-7,10-12,16H2,1-2H3,(H,27,28)/t20-,22?/m0/s1
Reactome pathway
n/an/a 46n/an/an/an/an/an/a
Bristol-Myers Squibb Pharmaceutical Research Institute
Curated by ChEMBL
Assay Description
Inhibitory activity against human FXa
Bioorg Med Chem Lett 15: 5453-8 (2005)
Article DOI: 10.1016/j.bmcl.2005.08.107
BindingDB Entry DOI: 10.7270/Q2KH0MW5