BDBM50175084 (S,Z)-tert-butyl 2-cyano-3-(2-methylbenzofuran-5-ylamino)-3-(2-oxo-1-(2-oxo-2-(pyrrolidin-1-yl)ethyl)azepan-3-ylamino)acrylate::CHEMBL381657
SMILES: Cc1cc2cc(ccc2o1)N=C(N[C@H]1CCCCN(CC(=O)N2CCCC2)C1=O)C(C#N)C(=O)OC(C)(C)C
InChI Key: InChIKey=LXMBBKHFDCFDKO-WCSIJFPASA-N
Data: 1 IC50
Activity Spreadsheet -- Enzyme Inhibition Constant Data from BindingDB
Found 1 hit for monomerid = 50175084
Trg + Lig
Ki
nM
ΔG°
kcal/mole
IC50
nM
Kd
nM
EC50/IC50
nM
koff
s-1
kon
M-1s-1
pHTemp
°C
Coagulation factor X
(Homo sapiens (Human))
BDBM50175084
((S,Z)-tert-butyl 2-cyano-3-(2-methylbenzofuran-5-y...)
Show SMILES Cc1cc2cc(ccc2o1)N=C(N[C@H]1CCCCN(CC(=O)N2CCCC2)C1=O)C(C#N)C(=O)OC(C)(C)C |w:10.11|
Show InChI InChI=1S/C29H37N5O5/c1-19-15-20-16-21(10-11-24(20)38-19)31-26(22(17-30)28(37)39-29(2,3)4)32-23-9-5-6-14-34(27(23)36)18-25(35)33-12-7-8-13-33/h10-11,15-16,22-23H,5-9,12-14,18H2,1-4H3,(H,31,32)/t22?,23-/m0/s1
Reactome pathway
n/an/a 57n/an/an/an/an/an/a
Bristol-Myers Squibb Pharmaceutical Research Institute
Curated by ChEMBL
Assay Description
Inhibitory activity against human FXa
Bioorg Med Chem Lett 15: 5453-8 (2005)
Article DOI: 10.1016/j.bmcl.2005.08.107
BindingDB Entry DOI: 10.7270/Q2KH0MW5