BDBM50175227 CHEMBL3809399
SMILES: Cc1cc(C)c(Nc2ccc(Cl)c(Cl)c2)c(C)c1
InChI Key: InChIKey=MWYQCYREPKMSBV-UHFFFAOYSA-N
Data: 1 IC50
Activity Spreadsheet -- Enzyme Inhibition Constant Data from BindingDB
Found 1 hit for monomerid = 50175227
Trg + Lig
Ki
nM
ΔG°
kcal/mole
IC50
nM
Kd
nM
EC50/IC50
nM
koff
s-1
kon
M-1s-1
pHTemp
°C
Rap guanine nucleotide exchange factor 4
(Homo sapiens (Human))
BDBM50175227
(CHEMBL3809399)
Show SMILES Cc1cc(C)c(Nc2ccc(Cl)c(Cl)c2)c(C)c1
Show InChI InChI=1S/C15H15Cl2N/c1-9-6-10(2)15(11(3)7-9)18-12-4-5-13(16)14(17)8-12/h4-8,18H,1-3H3
Reactome pathway
n/an/a 1.10E+3n/an/an/an/an/an/a
University of Texas Medical Branch
Curated by ChEMBL
Assay Description
Inhibition of 8-NBD-cAMP binding to EPAC2 (unknown origin) by microplate reader analysis
ACS Med Chem Lett 7: 460-4 (2016)
BindingDB Entry DOI: 10.7270/Q2NC6335