BDBM50175267 CHEMBL3809943
SMILES: Cc1cc(C)c(Nc2cccc(Br)c2)c(C)c1
InChI Key: InChIKey=NLWUSLOFNWJNHX-UHFFFAOYSA-N
Data: 1 IC50
Activity Spreadsheet -- Enzyme Inhibition Constant Data from BindingDB
Found 1 hit for monomerid = 50175267
Trg + Lig
Ki
nM
ΔG°
kcal/mole
IC50
nM
Kd
nM
EC50/IC50
nM
koff
s-1
kon
M-1s-1
pHTemp
°C
Rap guanine nucleotide exchange factor 4
(Homo sapiens (Human))
BDBM50175267
(CHEMBL3809943)
Show SMILES Cc1cc(C)c(Nc2cccc(Br)c2)c(C)c1
Show InChI InChI=1S/C15H16BrN/c1-10-7-11(2)15(12(3)8-10)17-14-6-4-5-13(16)9-14/h4-9,17H,1-3H3
Reactome pathway
n/an/a 1.50E+3n/an/an/an/an/an/a
University of Texas Medical Branch
Curated by ChEMBL
Assay Description
Inhibition of 8-NBD-cAMP binding to EPAC2 (unknown origin) by microplate reader analysis
ACS Med Chem Lett 7: 460-4 (2016)
BindingDB Entry DOI: 10.7270/Q2NC6335