BDBM50175307 CHEMBL3809311
SMILES: Clc1ccc(NC(=O)Nc2ccc(CNc3nc4ccc(OCCN5CCOCC5)cc4o3)cc2)c(Cl)c1
InChI Key: InChIKey=DYRKYYAYQSPMOS-UHFFFAOYSA-N
Data: 1 IC50
Activity Spreadsheet -- Enzyme Inhibition Constant Data from BindingDB
Found 1 hit for monomerid = 50175307
Trg + Lig
Ki
nM
ΔG°
kcal/mole
IC50
nM
Kd
nM
EC50/IC50
nM
koff
s-1
kon
M-1s-1
pHTemp
°C
Aurora kinase B
(Homo sapiens (Human))
BDBM50175307
(CHEMBL3809311)
Show SMILES Clc1ccc(NC(=O)Nc2ccc(CNc3nc4ccc(OCCN5CCOCC5)cc4o3)cc2)c(Cl)c1
Show InChI InChI=1S/C27H27Cl2N5O4/c28-19-3-7-23(22(29)15-19)32-26(35)31-20-4-1-18(2-5-20)17-30-27-33-24-8-6-21(16-25(24)38-27)37-14-11-34-9-12-36-13-10-34/h1-8,15-16H,9-14,17H2,(H,30,33)(H2,31,32,35)
Reactome pathway
n/an/a 700n/an/an/an/an/an/a
Sookmyung Women's University
Curated by ChEMBL
Assay Description
Inhibition of Aurora B (unknown origin) using myelin protein as substrate assessed as ADP generation after 60 mins by ADP-glo assay
Bioorg Med Chem Lett 26: 3067-72 (2016)
BindingDB Entry DOI: 10.7270/Q20K2BGN