BDBM50175324 (4S,7S,11aS)-7-(2-naphthamido)-N-((3S)-2-hydroxy-5-oxo-tetrahydrofuran-3-yl)-6-oxo-1,3,4,6,7,8,11,11a-octahydro-[1,4]oxazino[4,3-a]azocine-4-carboxamide::CHEMBL200290
SMILES: OC1OC(=O)C[C@@H]1NC(=O)[C@@H]1COC[C@@H]2C\C=C/C[C@H](NC(=O)c3ccc4ccccc4c3)C(=O)N12
InChI Key: InChIKey=GQQXKKFJUWJZOU-VXKIADEDSA-N
Data: 3 IC50
Activity Spreadsheet -- Enzyme Inhibition Constant Data from BindingDB
Found 3 hits for monomerid = 50175324
Trg + Lig
Ki
nM
ΔG°
kcal/mole
IC50
nM
Kd
nM
EC50/IC50
nM
koff
s-1
kon
M-1s-1
pHTemp
°C
Caspase-3
(Homo sapiens (Human))
BDBM50175324
((4S,7S,11aS)-7-(2-naphthamido)-N-((3S)-2-hydroxy-5...)
Show SMILES OC1OC(=O)C[C@@H]1NC(=O)[C@@H]1COC[C@@H]2C\C=C/C[C@H](NC(=O)c3ccc4ccccc4c3)C(=O)N12 |c:17|
Show InChI InChI=1S/C26H27N3O7/c30-22-12-20(26(34)36-22)28-24(32)21-14-35-13-18-7-3-4-8-19(25(33)29(18)21)27-23(31)17-10-9-15-5-1-2-6-16(15)11-17/h1-6,9-11,18-21,26,34H,7-8,12-14H2,(H,27,31)(H,28,32)/b4-3-/t18-,19-,20-,21-,26?/m0/s1
NCI pathway
Reactome pathway
n/an/a>1.00E+4n/an/an/an/an/an/a
Procter & Gamble Pharmaceuticals, Inc.
Curated by ChEMBL
Assay Description
Inhibitory activity against Caspase 3
Bioorg Med Chem Lett 15: 5434-8 (2005)
Article DOI: 10.1016/j.bmcl.2005.08.109
BindingDB Entry DOI: 10.7270/Q21G0KTJ
Caspase-8
(Homo sapiens (Human))
BDBM50175324
((4S,7S,11aS)-7-(2-naphthamido)-N-((3S)-2-hydroxy-5...)
Show SMILES OC1OC(=O)C[C@@H]1NC(=O)[C@@H]1COC[C@@H]2C\C=C/C[C@H](NC(=O)c3ccc4ccccc4c3)C(=O)N12 |c:17|
Show InChI InChI=1S/C26H27N3O7/c30-22-12-20(26(34)36-22)28-24(32)21-14-35-13-18-7-3-4-8-19(25(33)29(18)21)27-23(31)17-10-9-15-5-1-2-6-16(15)11-17/h1-6,9-11,18-21,26,34H,7-8,12-14H2,(H,27,31)(H,28,32)/b4-3-/t18-,19-,20-,21-,26?/m0/s1
NCI pathway
Reactome pathway
n/an/a 2.59E+3n/an/an/an/an/an/a
Procter & Gamble Pharmaceuticals, Inc.
Curated by ChEMBL
Assay Description
Inhibitory activity against Caspase 8
Bioorg Med Chem Lett 15: 5434-8 (2005)
Article DOI: 10.1016/j.bmcl.2005.08.109
BindingDB Entry DOI: 10.7270/Q21G0KTJ
Caspase-1
(Homo sapiens (Human))
BDBM50175324
((4S,7S,11aS)-7-(2-naphthamido)-N-((3S)-2-hydroxy-5...)
Show SMILES OC1OC(=O)C[C@@H]1NC(=O)[C@@H]1COC[C@@H]2C\C=C/C[C@H](NC(=O)c3ccc4ccccc4c3)C(=O)N12 |c:17|
Show InChI InChI=1S/C26H27N3O7/c30-22-12-20(26(34)36-22)28-24(32)21-14-35-13-18-7-3-4-8-19(25(33)29(18)21)27-23(31)17-10-9-15-5-1-2-6-16(15)11-17/h1-6,9-11,18-21,26,34H,7-8,12-14H2,(H,27,31)(H,28,32)/b4-3-/t18-,19-,20-,21-,26?/m0/s1
NCI pathway
Reactome pathway
n/an/a 3n/an/an/an/an/an/a
Procter & Gamble Pharmaceuticals, Inc.
Curated by ChEMBL
Assay Description
Inhibitory activity against Caspase 1
Bioorg Med Chem Lett 15: 5434-8 (2005)
Article DOI: 10.1016/j.bmcl.2005.08.109
BindingDB Entry DOI: 10.7270/Q21G0KTJ