BDBM50175333 (4S,7S,11aS)-7-(benzo[b]thiophene-2-carboxamido)-N-((3S)-2-hydroxy-5-oxo-tetrahydrofuran-3-yl)-6-oxo-1,3,4,6,7,8,11,11a-octahydro-[1,4]oxazino[4,3-a]azocine-4-carboxamide::CHEMBL200266
SMILES: OC1OC(=O)C[C@@H]1NC(=O)[C@@H]1COC[C@@H]2C\C=C/C[C@H](NC(=O)c3cc4ccccc4s3)C(=O)N12
InChI Key: InChIKey=KVNYNGQCOXBPGZ-PVVHDGSASA-N
Data: 3 IC50
Activity Spreadsheet -- Enzyme Inhibition Constant Data from BindingDB
Found 3 hits for monomerid = 50175333
Trg + Lig
Ki
nM
ΔG°
kcal/mole
IC50
nM
Kd
nM
EC50/IC50
nM
koff
s-1
kon
M-1s-1
pHTemp
°C
Caspase-1
(Homo sapiens (Human))
BDBM50175333
((4S,7S,11aS)-7-(benzo[b]thiophene-2-carboxamido)-N...)
Show SMILES OC1OC(=O)C[C@@H]1NC(=O)[C@@H]1COC[C@@H]2C\C=C/C[C@H](NC(=O)c3cc4ccccc4s3)C(=O)N12 |c:17|
Show InChI InChI=1S/C24H25N3O7S/c28-20-10-16(24(32)34-20)26-21(29)17-12-33-11-14-6-2-3-7-15(23(31)27(14)17)25-22(30)19-9-13-5-1-4-8-18(13)35-19/h1-5,8-9,14-17,24,32H,6-7,10-12H2,(H,25,30)(H,26,29)/b3-2-/t14-,15-,16-,17-,24?/m0/s1
NCI pathway
Reactome pathway
n/an/a 3n/an/an/an/an/an/a
Procter & Gamble Pharmaceuticals, Inc.
Curated by ChEMBL
Assay Description
Inhibitory activity against Caspase 1
Bioorg Med Chem Lett 15: 5434-8 (2005)
Article DOI: 10.1016/j.bmcl.2005.08.109
BindingDB Entry DOI: 10.7270/Q21G0KTJ
Caspase-3
(Homo sapiens (Human))
BDBM50175333
((4S,7S,11aS)-7-(benzo[b]thiophene-2-carboxamido)-N...)
Show SMILES OC1OC(=O)C[C@@H]1NC(=O)[C@@H]1COC[C@@H]2C\C=C/C[C@H](NC(=O)c3cc4ccccc4s3)C(=O)N12 |c:17|
Show InChI InChI=1S/C24H25N3O7S/c28-20-10-16(24(32)34-20)26-21(29)17-12-33-11-14-6-2-3-7-15(23(31)27(14)17)25-22(30)19-9-13-5-1-4-8-18(13)35-19/h1-5,8-9,14-17,24,32H,6-7,10-12H2,(H,25,30)(H,26,29)/b3-2-/t14-,15-,16-,17-,24?/m0/s1
NCI pathway
Reactome pathway
n/an/a>1.00E+4n/an/an/an/an/an/a
Procter & Gamble Pharmaceuticals, Inc.
Curated by ChEMBL
Assay Description
Inhibitory activity against Caspase 3
Bioorg Med Chem Lett 15: 5434-8 (2005)
Article DOI: 10.1016/j.bmcl.2005.08.109
BindingDB Entry DOI: 10.7270/Q21G0KTJ
Caspase-8
(Homo sapiens (Human))
BDBM50175333
((4S,7S,11aS)-7-(benzo[b]thiophene-2-carboxamido)-N...)
Show SMILES OC1OC(=O)C[C@@H]1NC(=O)[C@@H]1COC[C@@H]2C\C=C/C[C@H](NC(=O)c3cc4ccccc4s3)C(=O)N12 |c:17|
Show InChI InChI=1S/C24H25N3O7S/c28-20-10-16(24(32)34-20)26-21(29)17-12-33-11-14-6-2-3-7-15(23(31)27(14)17)25-22(30)19-9-13-5-1-4-8-18(13)35-19/h1-5,8-9,14-17,24,32H,6-7,10-12H2,(H,25,30)(H,26,29)/b3-2-/t14-,15-,16-,17-,24?/m0/s1
NCI pathway
Reactome pathway
n/an/a 1.60E+3n/an/an/an/an/an/a
Procter & Gamble Pharmaceuticals, Inc.
Curated by ChEMBL
Assay Description
Inhibitory activity against Caspase 8
Bioorg Med Chem Lett 15: 5434-8 (2005)
Article DOI: 10.1016/j.bmcl.2005.08.109
BindingDB Entry DOI: 10.7270/Q21G0KTJ