BDBM50175334 (4S,7S,11aS)-7-(3-chlorobenzamido)-N-((3S)-2-hydroxy-5-oxo-tetrahydrofuran-3-yl)-6-oxo-1,3,4,6,7,8,11,11a-octahydro-[1,4]oxazino[4,3-a]azocine-4-carboxamide::CHEMBL433990
SMILES: OC1OC(=O)C[C@@H]1NC(=O)[C@@H]1COC[C@@H]2C\C=C/C[C@H](NC(=O)c3cccc(Cl)c3)C(=O)N12
InChI Key: InChIKey=CPCMFDHSADMUTF-VNAVJBQCSA-N
Data: 3 IC50
Activity Spreadsheet -- Enzyme Inhibition Constant Data from BindingDB
Found 3 hits for monomerid = 50175334
Trg + Lig
Ki
nM
ΔG°
kcal/mole
IC50
nM
Kd
nM
EC50/IC50
nM
koff
s-1
kon
M-1s-1
pHTemp
°C
Caspase-3
(Homo sapiens (Human))
BDBM50175334
((4S,7S,11aS)-7-(3-chlorobenzamido)-N-((3S)-2-hydro...)
Show SMILES OC1OC(=O)C[C@@H]1NC(=O)[C@@H]1COC[C@@H]2C\C=C/C[C@H](NC(=O)c3cccc(Cl)c3)C(=O)N12 |c:17|
Show InChI InChI=1S/C22H24ClN3O7/c23-13-5-3-4-12(8-13)19(28)24-15-7-2-1-6-14-10-32-11-17(26(14)21(15)30)20(29)25-16-9-18(27)33-22(16)31/h1-5,8,14-17,22,31H,6-7,9-11H2,(H,24,28)(H,25,29)/b2-1-/t14-,15-,16-,17-,22?/m0/s1
NCI pathway
Reactome pathway
n/an/a>1.00E+4n/an/an/an/an/an/a
Procter & Gamble Pharmaceuticals, Inc.
Curated by ChEMBL
Assay Description
Inhibitory activity against Caspase 3
Bioorg Med Chem Lett 15: 5434-8 (2005)
Article DOI: 10.1016/j.bmcl.2005.08.109
BindingDB Entry DOI: 10.7270/Q21G0KTJ
Caspase-8
(Homo sapiens (Human))
BDBM50175334
((4S,7S,11aS)-7-(3-chlorobenzamido)-N-((3S)-2-hydro...)
Show SMILES OC1OC(=O)C[C@@H]1NC(=O)[C@@H]1COC[C@@H]2C\C=C/C[C@H](NC(=O)c3cccc(Cl)c3)C(=O)N12 |c:17|
Show InChI InChI=1S/C22H24ClN3O7/c23-13-5-3-4-12(8-13)19(28)24-15-7-2-1-6-14-10-32-11-17(26(14)21(15)30)20(29)25-16-9-18(27)33-22(16)31/h1-5,8,14-17,22,31H,6-7,9-11H2,(H,24,28)(H,25,29)/b2-1-/t14-,15-,16-,17-,22?/m0/s1
NCI pathway
Reactome pathway
n/an/a 1.55E+3n/an/an/an/an/an/a
Procter & Gamble Pharmaceuticals, Inc.
Curated by ChEMBL
Assay Description
Inhibitory activity against Caspase 8
Bioorg Med Chem Lett 15: 5434-8 (2005)
Article DOI: 10.1016/j.bmcl.2005.08.109
BindingDB Entry DOI: 10.7270/Q21G0KTJ
Caspase-1
(Homo sapiens (Human))
BDBM50175334
((4S,7S,11aS)-7-(3-chlorobenzamido)-N-((3S)-2-hydro...)
Show SMILES OC1OC(=O)C[C@@H]1NC(=O)[C@@H]1COC[C@@H]2C\C=C/C[C@H](NC(=O)c3cccc(Cl)c3)C(=O)N12 |c:17|
Show InChI InChI=1S/C22H24ClN3O7/c23-13-5-3-4-12(8-13)19(28)24-15-7-2-1-6-14-10-32-11-17(26(14)21(15)30)20(29)25-16-9-18(27)33-22(16)31/h1-5,8,14-17,22,31H,6-7,9-11H2,(H,24,28)(H,25,29)/b2-1-/t14-,15-,16-,17-,22?/m0/s1
NCI pathway
Reactome pathway
n/an/a 7n/an/an/an/an/an/a
Procter & Gamble Pharmaceuticals, Inc.
Curated by ChEMBL
Assay Description
Inhibitory activity against Caspase 1
Bioorg Med Chem Lett 15: 5434-8 (2005)
Article DOI: 10.1016/j.bmcl.2005.08.109
BindingDB Entry DOI: 10.7270/Q21G0KTJ