BDBM50175359 2-(((R)-2-((R)-1-hydroxy-2-(2-methyl-1-(naphthalen-2-yl)propan-2-ylamino)ethyl)pyrrolidin-1-yl)methyl)-6-methoxyphenol::CHEMBL200422
SMILES: COc1cccc(CN2CCC[C@@H]2[C@H](O)CNC(C)(C)Cc2ccc3ccccc3c2)c1O
InChI Key: InChIKey=ROZPFCVQFHWPAO-JWQCQUIFSA-N
Data: 1 IC50
Activity Spreadsheet -- Enzyme Inhibition Constant Data from BindingDB
Found 1 hit for monomerid = 50175359
Trg + Lig
Ki
nM
ΔG°
kcal/mole
IC50
nM
Kd
nM
EC50/IC50
nM
koff
s-1
kon
M-1s-1
pHTemp
°C
Calcium-sensing receptor (CaSR)
(Homo sapiens (Human))
BDBM50175359
(2-(((R)-2-((R)-1-hydroxy-2-(2-methyl-1-(naphthalen...)
Show SMILES COc1cccc(CN2CCC[C@@H]2[C@H](O)CNC(C)(C)Cc2ccc3ccccc3c2)c1O
Show InChI InChI=1S/C28H36N2O3/c1-28(2,17-20-13-14-21-8-4-5-9-22(21)16-20)29-18-25(31)24-11-7-15-30(24)19-23-10-6-12-26(33-3)27(23)32/h4-6,8-10,12-14,16,24-25,29,31-32H,7,11,15,17-19H2,1-3H3/t24-,25-/m1/s1
n/an/a 1.56E+3n/an/an/an/an/an/a
Bristol-Myers Squibb Pharmaceutical Research Institute
Curated by ChEMBL
Assay Description
Inhibition of intracellular calcium release in human TT cells containing calcium-sensing receptor by FLIPR
Bioorg Med Chem Lett 15: 5478-82 (2005)
Article DOI: 10.1016/j.bmcl.2005.08.095
BindingDB Entry DOI: 10.7270/Q2WS8STX