null
SMILES: Cc1cn([C@@H]2O[C@H](CO[Si](C)(C)C(C)(C)C)[C@@]3(OS(=O)(=O)C=C3N)[C@H]2O[Si](C)(C)C(C)(C)C)c(=O)n(CCBr)c1=O
InChI Key: InChIKey=FWHRECABAAMTSI-UHFFFAOYSA-N
Activity Spreadsheet -- Enzyme Inhibition Constant Data from BindingDB
Found 1 hit for monomerid = 50175619
Trg + Lig
Ki
nM
ΔG°
kcal/mole
IC50
nM
Kd
nM
EC50/IC50
nM
koff
s-1
kon
M-1s-1
pHTemp
°C
Reverse transcriptase/RNaseH
(Human immunodeficiency virus 1)
BDBM50175619
(1-[4-Amino-9-(tert-butyl-dimethyl-silanyloxy)-6-(t...)
Show SMILES Cc1cn([C@@H]2O[C@H](CO[Si](C)(C)C(C)(C)C)[C@@]3(OS(=O)(=O)C=C3N)[C@H]2O[Si](C)(C)C(C)(C)C)c(=O)n(CCBr)c1=O |r,c:21|
Show InChI InChI=1S/C26H46BrN3O8SSi2/c1-17-14-30(23(32)29(13-12-27)21(17)31)22-20(37-41(10,11)25(5,6)7)26(18(28)16-39(33,34)38-26)19(36-22)15-35-40(8,9)24(2,3)4/h14,16,19-20,22H,12-13,15,28H2,1-11H3
n/an/a>5.00E+5n/an/an/an/an/an/a
Instituto de Química Médica (C.S.I.C.)
Curated by ChEMBL
Assay Description
Inhibitory concentration required to inhibit recombinant HIV-1 reverse transcriptase
J Med Chem 48: 6653-60 (2005)
Article DOI: 10.1021/jm050437n
BindingDB Entry DOI: 10.7270/Q2VT1RP3