BDBM50175689 (4-(4-(benzo[b]thiophen-2-yl)pyrimidin-2-ylamino)phenyl)(4-(dimethylamino)piperidin-1-yl)methanone::CHEMBL200229
SMILES: CN(C)C1CCN(CC1)C(=O)c1ccc(Nc2nccc(n2)-c2cc3ccccc3s2)cc1
InChI Key: InChIKey=ALNKZWZEELZRCE-UHFFFAOYSA-N
Data: 7 IC50
Activity Spreadsheet -- Enzyme Inhibition Constant Data from BindingDB
Found 7 hits for monomerid = 50175689
Trg + Lig
Ki
nM
ΔG°
kcal/mole
IC50
nM
Kd
nM
EC50/IC50
nM
koff
s-1
kon
M-1s-1
pHTemp
°C
Inhibitor of nuclear factor kappa-B kinase subunit beta
(Homo sapiens (Human))
BDBM50175689
((4-(4-(benzo[b]thiophen-2-yl)pyrimidin-2-ylamino)p...)
Show SMILES CN(C)C1CCN(CC1)C(=O)c1ccc(Nc2nccc(n2)-c2cc3ccccc3s2)cc1
Show InChI InChI=1S/C26H27N5OS/c1-30(2)21-12-15-31(16-13-21)25(32)18-7-9-20(10-8-18)28-26-27-14-11-22(29-26)24-17-19-5-3-4-6-23(19)33-24/h3-11,14,17,21H,12-13,15-16H2,1-2H3,(H,27,28,29)
NCI pathway
Reactome pathway
n/an/a 4n/an/an/an/an/an/a
Novartis Institutes for BioMedical Research
Curated by ChEMBL
Assay Description
Inhibitory activity against IKK2
Bioorg Med Chem Lett 16: 108-12 (2005)
Article DOI: 10.1016/j.bmcl.2005.09.035
BindingDB Entry DOI: 10.7270/Q2BR8RQV
I-kappa-B Kinase 1 (IKK-alpha)/I-kappa-B Kinase 2 (IKK-beta)/NF-kappa-B essential modulator
(Homo sapiens (Human))
BDBM50175689
((4-(4-(benzo[b]thiophen-2-yl)pyrimidin-2-ylamino)p...)
Show SMILES CN(C)C1CCN(CC1)C(=O)c1ccc(Nc2nccc(n2)-c2cc3ccccc3s2)cc1
Show InChI InChI=1S/C26H27N5OS/c1-30(2)21-12-15-31(16-13-21)25(32)18-7-9-20(10-8-18)28-26-27-14-11-22(29-26)24-17-19-5-3-4-6-23(19)33-24/h3-11,14,17,21H,12-13,15-16H2,1-2H3,(H,27,28,29)
n/an/a 2n/an/an/an/an/an/a
Novartis Institutes for BioMedical Research
Curated by ChEMBL
Assay Description
Inhibition of TNF-alpha-stimulated IkappaBalpha degradation
Bioorg Med Chem Lett 16: 108-12 (2005)
Article DOI: 10.1016/j.bmcl.2005.09.035
BindingDB Entry DOI: 10.7270/Q2BR8RQV
I-kappa-B Kinase 1 (IKK-alpha)/I-kappa-B Kinase 2 (IKK-beta)/NF-kappa-B essential modulator
(Homo sapiens (Human))
BDBM50175689
((4-(4-(benzo[b]thiophen-2-yl)pyrimidin-2-ylamino)p...)
Show SMILES CN(C)C1CCN(CC1)C(=O)c1ccc(Nc2nccc(n2)-c2cc3ccccc3s2)cc1
Show InChI InChI=1S/C26H27N5OS/c1-30(2)21-12-15-31(16-13-21)25(32)18-7-9-20(10-8-18)28-26-27-14-11-22(29-26)24-17-19-5-3-4-6-23(19)33-24/h3-11,14,17,21H,12-13,15-16H2,1-2H3,(H,27,28,29)
n/an/a 3n/an/an/an/an/an/a
Novartis Institutes for BioMedical Research
Curated by ChEMBL
Assay Description
Inhibition of TNF-alpha-stimulated expression of E-selectin in HUVEC cells
Bioorg Med Chem Lett 16: 108-12 (2005)
Article DOI: 10.1016/j.bmcl.2005.09.035
BindingDB Entry DOI: 10.7270/Q2BR8RQV
I-kappa-B Kinase 1 (IKK-alpha)/I-kappa-B Kinase 2 (IKK-beta)/NF-kappa-B essential modulator
(Homo sapiens (Human))
BDBM50175689
((4-(4-(benzo[b]thiophen-2-yl)pyrimidin-2-ylamino)p...)
Show SMILES CN(C)C1CCN(CC1)C(=O)c1ccc(Nc2nccc(n2)-c2cc3ccccc3s2)cc1
Show InChI InChI=1S/C26H27N5OS/c1-30(2)21-12-15-31(16-13-21)25(32)18-7-9-20(10-8-18)28-26-27-14-11-22(29-26)24-17-19-5-3-4-6-23(19)33-24/h3-11,14,17,21H,12-13,15-16H2,1-2H3,(H,27,28,29)
n/an/a 4n/an/an/an/an/an/a
Novartis Institutes for BioMedical Research
Curated by ChEMBL
Assay Description
Inhibition of TNF-alpha-stimulated expression of VCAM1 in HUVEC cells
Bioorg Med Chem Lett 16: 108-12 (2005)
Article DOI: 10.1016/j.bmcl.2005.09.035
BindingDB Entry DOI: 10.7270/Q2BR8RQV
Inhibitor of nuclear factor kappa-B kinase subunit alpha
(Homo sapiens (Human))
BDBM50175689
((4-(4-(benzo[b]thiophen-2-yl)pyrimidin-2-ylamino)p...)
Show SMILES CN(C)C1CCN(CC1)C(=O)c1ccc(Nc2nccc(n2)-c2cc3ccccc3s2)cc1
Show InChI InChI=1S/C26H27N5OS/c1-30(2)21-12-15-31(16-13-21)25(32)18-7-9-20(10-8-18)28-26-27-14-11-22(29-26)24-17-19-5-3-4-6-23(19)33-24/h3-11,14,17,21H,12-13,15-16H2,1-2H3,(H,27,28,29)
Reactome pathway
n/an/a 15n/an/an/an/an/an/a
Novartis Institutes for BioMedical Research
Curated by ChEMBL
Assay Description
Inhibitory activity against IKK1
Bioorg Med Chem Lett 16: 108-12 (2005)
Article DOI: 10.1016/j.bmcl.2005.09.035
BindingDB Entry DOI: 10.7270/Q2BR8RQV
I-kappa-B Kinase 1 (IKK-alpha)/I-kappa-B Kinase 2 (IKK-beta)/NF-kappa-B essential modulator
(Homo sapiens (Human))
BDBM50175689
((4-(4-(benzo[b]thiophen-2-yl)pyrimidin-2-ylamino)p...)
Show SMILES CN(C)C1CCN(CC1)C(=O)c1ccc(Nc2nccc(n2)-c2cc3ccccc3s2)cc1
Show InChI InChI=1S/C26H27N5OS/c1-30(2)21-12-15-31(16-13-21)25(32)18-7-9-20(10-8-18)28-26-27-14-11-22(29-26)24-17-19-5-3-4-6-23(19)33-24/h3-11,14,17,21H,12-13,15-16H2,1-2H3,(H,27,28,29)
n/an/a 4n/an/an/an/an/an/a
Novartis Institutes for BioMedical Research
Curated by ChEMBL
Assay Description
Inhibition of TNF-alpha-stimulated expression of ICAM1 in HUVEC cells
Bioorg Med Chem Lett 16: 108-12 (2005)
Article DOI: 10.1016/j.bmcl.2005.09.035
BindingDB Entry DOI: 10.7270/Q2BR8RQV
I-kappa-B Kinase 1 (IKK-alpha)/I-kappa-B Kinase 2 (IKK-beta)/NF-kappa-B essential modulator
(Homo sapiens (Human))
BDBM50175689
((4-(4-(benzo[b]thiophen-2-yl)pyrimidin-2-ylamino)p...)
Show SMILES CN(C)C1CCN(CC1)C(=O)c1ccc(Nc2nccc(n2)-c2cc3ccccc3s2)cc1
Show InChI InChI=1S/C26H27N5OS/c1-30(2)21-12-15-31(16-13-21)25(32)18-7-9-20(10-8-18)28-26-27-14-11-22(29-26)24-17-19-5-3-4-6-23(19)33-24/h3-11,14,17,21H,12-13,15-16H2,1-2H3,(H,27,28,29)
n/an/a 8n/an/an/an/an/an/a
Novartis Institutes for BioMedical Research
Curated by ChEMBL
Assay Description
Inhibitory activity against IKK complex isolated from HeLa cells
Bioorg Med Chem Lett 16: 108-12 (2005)
Article DOI: 10.1016/j.bmcl.2005.09.035
BindingDB Entry DOI: 10.7270/Q2BR8RQV