BDBM50175776 1-ALLYL-5-(2-PHENYLPYRAZOLO[1,5-A]PYRIDIN-3-YL)-1H-PYRAZOLO[3,4-C]PYRIDAZIN-3-AMINE::1-allyl-5-(2-phenylH-pyrazolo[1,5-a]pyridin-3-yl)-1H-pyrazolo[3,4-c]pyridazin-3-amine::CHEMBL199395
SMILES: Nc1nn(CC=C)c2nnc(cc12)-c1c(nn2ccccc12)-c1ccccc1
InChI Key: InChIKey=WHPQRPGHYADIAQ-UHFFFAOYSA-N
Data: 1 IC50
PDB links: 1 PDB ID matches this monomer.
Activity Spreadsheet -- Enzyme Inhibition Constant Data from BindingDB
Found 1 hit for monomerid = 50175776
Trg + Lig
Ki
nM
ΔG°
kcal/mole
IC50
nM
Kd
nM
EC50/IC50
nM
koff
s-1
kon
M-1s-1
pHTemp
°C
Mitogen-activated protein kinase 1
(Homo sapiens (Human))
BDBM50175776
(1-ALLYL-5-(2-PHENYLPYRAZOLO[1,5-A]PYRIDIN-3-YL)-1H...)
Show SMILES Nc1nn(CC=C)c2nnc(cc12)-c1c(nn2ccccc12)-c1ccccc1
Show InChI InChI=1S/C21H17N7/c1-2-11-28-21-15(20(22)26-28)13-16(23-24-21)18-17-10-6-7-12-27(17)25-19(18)14-8-4-3-5-9-14/h2-10,12-13H,1,11H2,(H2,22,26)
NCI pathway
Reactome pathway
n/an/a 560n/an/an/an/an/an/a
Fujisawa Pharmaceutical Co., Ltd
Curated by ChEMBL
Assay Description
Inhibitory activity against human ERK2
Bioorg Med Chem Lett 16: 55-8 (2005)
Article DOI: 10.1016/j.bmcl.2005.09.055
BindingDB Entry DOI: 10.7270/Q2Q23ZSV
3D
3D Structure (crystal)