BDBM50175931 1-(4-(1H-benzo[d]imidazol-2-yl)phenyl)-3-(4-(7-methyl-1H-benzo[d]imidazol-2-yl)phenyl)urea::CHEMBL199610
SMILES: Cc1cccc2[nH]c(nc12)-c1ccc(NC(=O)Nc2ccc(cc2)-c2nc3ccccc3[nH]2)cc1
InChI Key: InChIKey=ZSOLMBHGDASGLC-UHFFFAOYSA-N
Data: 1 IC50
Activity Spreadsheet -- Enzyme Inhibition Constant Data from BindingDB
Found 1 hit for monomerid = 50175931
Trg + Lig
Ki
nM
ΔG°
kcal/mole
IC50
nM
Kd
nM
EC50/IC50
nM
koff
s-1
kon
M-1s-1
pHTemp
°C
Heparanase
(Homo sapiens (Human))
BDBM50175931
(1-(4-(1H-benzo[d]imidazol-2-yl)phenyl)-3-(4-(7-met...)
Show SMILES Cc1cccc2[nH]c(nc12)-c1ccc(NC(=O)Nc2ccc(cc2)-c2nc3ccccc3[nH]2)cc1
Show InChI InChI=1S/C28H22N6O/c1-17-5-4-8-24-25(17)34-27(33-24)19-11-15-21(16-12-19)30-28(35)29-20-13-9-18(10-14-20)26-31-22-6-2-3-7-23(22)32-26/h2-16H,1H3,(H,31,32)(H,33,34)(H2,29,30,35)
n/an/a 150n/an/an/an/an/an/a
ImClone Systems Inc
Curated by ChEMBL
Assay Description
Inhibitory activity against heparanase from human platelets
Bioorg Med Chem Lett 16: 409-12 (2005)
Article DOI: 10.1016/j.bmcl.2005.09.069
BindingDB Entry DOI: 10.7270/Q2ST7PDB