BDBM50176479 (5-bromo-8-methyl-1-propyl-3,4-dihydro-1H-benzo[4,5]thieno[2,3-c]pyran-1-yl)-acetic acid::CHEMBL201313
SMILES: CCCC1(CC(O)=O)OCCc2c1sc1c(C)ccc(Br)c21
InChI Key: InChIKey=OBXCXCHHUAKXBV-UHFFFAOYSA-N
Data: 1 IC50
Activity Spreadsheet -- Enzyme Inhibition Constant Data from BindingDB
Found 1 hit for monomerid = 50176479
Trg + Lig
Ki
nM
ΔG°
kcal/mole
IC50
nM
Kd
nM
EC50/IC50
nM
koff
s-1
kon
M-1s-1
pHTemp
°C
Hepatitis C virus NS5B RNA-dependent RNA polymerase
(Hepatitis C virus)
BDBM50176479
((5-bromo-8-methyl-1-propyl-3,4-dihydro-1H-benzo[4,...)
Show SMILES CCCC1(CC(O)=O)OCCc2c1sc1c(C)ccc(Br)c21
Show InChI InChI=1S/C17H19BrO3S/c1-3-7-17(9-13(19)20)16-11(6-8-21-17)14-12(18)5-4-10(2)15(14)22-16/h4-5H,3,6-9H2,1-2H3,(H,19,20)
n/an/a 190n/an/an/an/an/an/a
Wyeth Research
Curated by ChEMBL
Assay Description
Displacement of [alpha-32P]GTP from recombinant HCV NS5B RNA dependent RNA polymerase
Bioorg Med Chem Lett 16: 457-60 (2005)
Article DOI: 10.1016/j.bmcl.2005.08.114
BindingDB Entry DOI: 10.7270/Q25X28H8