BDBM50176619 (R)-2-((R)-5-(2-(5-methyl-2-phenyloxazol-4-yl)ethoxy)-2,3-dihydro-1H-inden-1-yl)butanoic acid::CHEMBL372412
SMILES: CC[C@H]([C@H]1CCc2cc(OCCc3nc(oc3C)-c3ccccc3)ccc12)C(O)=O
InChI Key: InChIKey=XQWUEDSGGNBHSG-IFMALSPDSA-N
Data: 2 EC50
Activity Spreadsheet -- Enzyme Inhibition Constant Data from BindingDB
Found 2 hits for monomerid = 50176619
Trg + Lig
Ki
nM
ΔG°
kcal/mole
IC50
nM
Kd
nM
EC50/IC50
nM
koff
s-1
kon
M-1s-1
pHTemp
°C
Peroxisome proliferator-activated receptor gamma
(Homo sapiens (Human))
BDBM50176619
((R)-2-((R)-5-(2-(5-methyl-2-phenyloxazol-4-yl)etho...)
Show SMILES CC[C@H]([C@H]1CCc2cc(OCCc3nc(oc3C)-c3ccccc3)ccc12)C(O)=O
Show InChI InChI=1S/C25H27NO4/c1-3-20(25(27)28)22-11-9-18-15-19(10-12-21(18)22)29-14-13-23-16(2)30-24(26-23)17-7-5-4-6-8-17/h4-8,10,12,15,20,22H,3,9,11,13-14H2,1-2H3,(H,27,28)/t20-,22-/m1/s1
NCI pathway
Reactome pathway
n/an/an/an/a 605n/an/an/an/a
Bayer Research Center
Curated by ChEMBL
Assay Description
Activity against PPAR gamma in human by FRET assay
Bioorg Med Chem Lett 16: 297-301 (2005)
Article DOI: 10.1016/j.bmcl.2005.10.008
BindingDB Entry DOI: 10.7270/Q28P6025
Peroxisome proliferator-activated receptor alpha
(Homo sapiens (Human))
BDBM50176619
((R)-2-((R)-5-(2-(5-methyl-2-phenyloxazol-4-yl)etho...)
Show SMILES CC[C@H]([C@H]1CCc2cc(OCCc3nc(oc3C)-c3ccccc3)ccc12)C(O)=O
Show InChI InChI=1S/C25H27NO4/c1-3-20(25(27)28)22-11-9-18-15-19(10-12-21(18)22)29-14-13-23-16(2)30-24(26-23)17-7-5-4-6-8-17/h4-8,10,12,15,20,22H,3,9,11,13-14H2,1-2H3,(H,27,28)/t20-,22-/m1/s1
n/an/an/an/a>1.00E+4n/an/an/an/a
Bayer Research Center
Curated by ChEMBL
Assay Description
Activity against PPAR alpha in human by FRET assay
Bioorg Med Chem Lett 16: 297-301 (2005)
Article DOI: 10.1016/j.bmcl.2005.10.008
BindingDB Entry DOI: 10.7270/Q28P6025