BDBM50176812 CHEMBL3809861
SMILES: OC(=O)c1cccc(c1)N1N=C(\C(=C\c2ccc(o2)-c2ccccc2)C1=O)c1ccccc1
InChI Key: InChIKey=SQOXEZFEMGRSIQ-QJOMJCCJSA-N
Data: 1 IC50
Activity Spreadsheet -- Enzyme Inhibition Constant Data from BindingDB
Found 1 hit for monomerid = 50176812
Trg + Lig
Ki
nM
ΔG°
kcal/mole
IC50
nM
Kd
nM
EC50/IC50
nM
koff
s-1
kon
M-1s-1
pHTemp
°C
3C-like proteinase (3CL-PRO)
(Human SARS coronavirus (SARS-CoV) (Severe acute re...)
BDBM50176812
(CHEMBL3809861)
Show SMILES OC(=O)c1cccc(c1)N1N=C(\C(=C\c2ccc(o2)-c2ccccc2)C1=O)c1ccccc1 |c:11|
Show InChI InChI=1S/C27H18N2O4/c30-26-23(17-22-14-15-24(33-22)18-8-3-1-4-9-18)25(19-10-5-2-6-11-19)28-29(26)21-13-7-12-20(16-21)27(31)32/h1-17H,(H,31,32)/b23-17-
n/an/a 6.40E+3n/an/an/an/an/an/a
Academia Sinica
Curated by ChEMBL
Assay Description
Inhibition of SARS coronavirus recombinant 3CL-PRO expressed in Escherichia coli JM109 cells using Dabcyl-KTSAVLQSGFRKME-Edans as fluorogenic substra...
Bioorg Med Chem 24: 3035-3042 (2016)
BindingDB Entry DOI: 10.7270/Q2ZK5JK9