null
SMILES: CC(C)(C)OC(=O)NCCCCCC(=O)NCc1cccnc1
InChI Key: InChIKey=LDXDSDSWWMTDPA-UHFFFAOYSA-N
PDB links: 2 PDB IDs match this monomer.
Activity Spreadsheet -- Enzyme Inhibition Constant Data from BindingDB
Found 2 hits for monomerid = 50176908
Trg + Lig
Ki
nM
ΔG°
kcal/mole
IC50
nM
Kd
nM
EC50/IC50
nM
koff
s-1
kon
M-1s-1
pHTemp
°C
Cytochrome P450 3A4
(Homo sapiens (Human))
BDBM50176908
(CHEMBL3814075)
Show SMILES CC(C)(C)OC(=O)NCCCCCC(=O)NCc1cccnc1
Show InChI InChI=1S/C17H27N3O3/c1-17(2,3)23-16(22)19-11-6-4-5-9-15(21)20-13-14-8-7-10-18-12-14/h7-8,10,12H,4-6,9,11,13H2,1-3H3,(H,19,22)(H,20,21)
Reactome pathway
n/an/an/a 1.05E+5n/an/an/an/an/a
University of California-Irvine
Curated by ChEMBL
Assay Description
Binding affinity to C-terminal four-histidine tagged human CYP3A4delta3 to 24 residues expressed in Escherichia coli assessed as spectral dissociatio...
J Med Chem 59: 4210-20 (2016)
BindingDB Entry DOI: 10.7270/Q2Q52RKB
3D
3D Structure (crystal)
Cytochrome P450 3A4
(Homo sapiens (Human))
BDBM50176908
(CHEMBL3814075)
Show SMILES CC(C)(C)OC(=O)NCCCCCC(=O)NCc1cccnc1
Show InChI InChI=1S/C17H27N3O3/c1-17(2,3)23-16(22)19-11-6-4-5-9-15(21)20-13-14-8-7-10-18-12-14/h7-8,10,12H,4-6,9,11,13H2,1-3H3,(H,19,22)(H,20,21)
Reactome pathway
n/an/a 7.50E+4n/an/an/an/an/an/a
University of California-Irvine
Curated by ChEMBL
Assay Description
Inhibition of C-terminal four-histidine tagged human CYP3A4delta3 to 24 residues expressed in Escherichia coli assessed as 7-benzyloxy-4-(trifluorome...
J Med Chem 59: 4210-20 (2016)
BindingDB Entry DOI: 10.7270/Q2Q52RKB
3D
3D Structure (crystal)