BDBM50177139 CHEMBL3814492
SMILES: CCCCCCCCCCCOc1ccccc1CCC(=O)OCc1cccc(OP(O)(=O)OC[C@H](N)C(O)=O)c1
InChI Key: InChIKey=XKWKJVRGVWBGJM-MHZLTWQESA-N
Data: 2 EC50
Activity Spreadsheet -- Enzyme Inhibition Constant Data from BindingDB
Found 2 hits for monomerid = 50177139
Trg + Lig
Ki
nM
ΔG°
kcal/mole
IC50
nM
Kd
nM
EC50/IC50
nM
koff
s-1
kon
M-1s-1
pHTemp
°C
Putative P2Y purinoceptor 10
(Mus musculus)
BDBM50177139
(CHEMBL3814492)
Show SMILES CCCCCCCCCCCOc1ccccc1CCC(=O)OCc1cccc(OP(O)(=O)OC[C@H](N)C(O)=O)c1 |r|
Show InChI InChI=1S/C30H44NO9P/c1-2-3-4-5-6-7-8-9-12-20-37-28-17-11-10-15-25(28)18-19-29(32)38-22-24-14-13-16-26(21-24)40-41(35,36)39-23-27(31)30(33)34/h10-11,13-17,21,27H,2-9,12,18-20,22-23,31H2,1H3,(H,33,34)(H,35,36)/t27-/m0/s1
n/an/an/an/a 6.70n/an/an/an/a
The University of Tokyo
Curated by ChEMBL
Assay Description
Agonist activity at mouse P2Y10 receptor expressed in HEK293A cells after 1.5 hrs by alkaline phosphatase tagged-TGFalpha shedding assay
J Med Chem 59: 3750-76 (2016)
BindingDB Entry DOI: 10.7270/Q2542QHQ
Putative P2Y purinoceptor 10
(Mus musculus)
BDBM50177139
(CHEMBL3814492)
Show SMILES CCCCCCCCCCCOc1ccccc1CCC(=O)OCc1cccc(OP(O)(=O)OC[C@H](N)C(O)=O)c1 |r|
Show InChI InChI=1S/C30H44NO9P/c1-2-3-4-5-6-7-8-9-12-20-37-28-17-11-10-15-25(28)18-19-29(32)38-22-24-14-13-16-26(21-24)40-41(35,36)39-23-27(31)30(33)34/h10-11,13-17,21,27H,2-9,12,18-20,22-23,31H2,1H3,(H,33,34)(H,35,36)/t27-/m0/s1
n/an/an/an/a 6.60n/an/an/an/a
The University of Tokyo
Curated by ChEMBL
Assay Description
Agonist activity at mouse P2Y10 receptor expressed in HEK293A cells after 1.5 hrs by alkaline phosphatase tagged-TGFalpha shedding assay
J Med Chem 59: 3750-76 (2016)
BindingDB Entry DOI: 10.7270/Q2542QHQ