null
SMILES: CCCCCSc1nc2ncsc2c(=O)[nH]1
InChI Key: InChIKey=QONMYXCFINJDMT-UHFFFAOYSA-N
Activity Spreadsheet -- Enzyme Inhibition Constant Data from BindingDB
Found 1 hit for monomerid = 50177609
Trg + Lig
Ki
nM
ΔG°
kcal/mole
IC50
nM
Kd
nM
EC50/IC50
nM
koff
s-1
kon
M-1s-1
pHTemp
°C
C-X-C chemokine receptor type 2
(Homo sapiens (Human))
BDBM50177609
(5-(pentylthio)thiazolo[4,5-d]pyrimidin-7-ol | CHEM...)
Show SMILES CCCCCSc1nc2ncsc2c(=O)[nH]1
Show InChI InChI=1S/C10H13N3OS2/c1-2-3-4-5-15-10-12-8-7(9(14)13-10)16-6-11-8/h6H,2-5H2,1H3,(H,12,13,14)
Reactome pathway
n/an/a 1.00E+4n/an/an/an/an/an/a
AstraZeneca R&D Charnwood
Curated by ChEMBL
Assay Description
Displacement of [125I]IL8 from human recombinant CXCR2 expressed in HEK293 membranes by SPA
Bioorg Med Chem Lett 16: 960-3 (2006)
Article DOI: 10.1016/j.bmcl.2005.10.091
BindingDB Entry DOI: 10.7270/Q2D79B09