null
SMILES: OC(=O)CC(Cc1nc(CCCc2ccc3CCCNc3n2)no1)c1cnc2ccccc2c1
InChI Key: InChIKey=OKEKRFLAQTYOCR-UHFFFAOYSA-N
Activity Spreadsheet -- Enzyme Inhibition Constant Data from BindingDB
Found 2 hits for monomerid = 50177636
Trg + Lig
Ki
nM
ΔG°
kcal/mole
IC50
nM
Kd
nM
EC50/IC50
nM
koff
s-1
kon
M-1s-1
pHTemp
°C
Integrin alpha-V/beta-3
(Homo sapiens (Human))
BDBM50177636
(3-(quinolin-3-yl)-4-(3-(3-(5,6,7,8-tetrahydro-1,8-...)
Show SMILES OC(=O)CC(Cc1nc(CCCc2ccc3CCCNc3n2)no1)c1cnc2ccccc2c1
Show InChI InChI=1S/C26H27N5O3/c32-25(33)15-19(20-13-18-5-1-2-8-22(18)28-16-20)14-24-30-23(31-34-24)9-3-7-21-11-10-17-6-4-12-27-26(17)29-21/h1-2,5,8,10-11,13,16,19H,3-4,6-7,9,12,14-15H2,(H,27,29)(H,32,33)
n/an/a 0.650n/an/an/an/an/an/a
Pfizer Inc.
Curated by ChEMBL
Assay Description
Inhibition of Integrin alphav-beta3 receptor by SPRA assay
Bioorg Med Chem Lett 16: 839-44 (2006)
Article DOI: 10.1016/j.bmcl.2005.11.008
BindingDB Entry DOI: 10.7270/Q28K78NF
Integrin alpha-IIb/beta-3
(Homo sapiens (Human))
BDBM50177636
(3-(quinolin-3-yl)-4-(3-(3-(5,6,7,8-tetrahydro-1,8-...)
Show SMILES OC(=O)CC(Cc1nc(CCCc2ccc3CCCNc3n2)no1)c1cnc2ccccc2c1
Show InChI InChI=1S/C26H27N5O3/c32-25(33)15-19(20-13-18-5-1-2-8-22(18)28-16-20)14-24-30-23(31-34-24)9-3-7-21-11-10-17-6-4-12-27-26(17)29-21/h1-2,5,8,10-11,13,16,19H,3-4,6-7,9,12,14-15H2,(H,27,29)(H,32,33)
n/an/a 18n/an/an/an/an/an/a
Pfizer Inc.
Curated by ChEMBL
Assay Description
Inhibition of Integrin alpha2bbeta3 receptor by SPRA assay
Bioorg Med Chem Lett 16: 839-44 (2006)
Article DOI: 10.1016/j.bmcl.2005.11.008
BindingDB Entry DOI: 10.7270/Q28K78NF