BDBM50178181 CHEMBL3813744
SMILES: C[C@H](NC(=O)c1cccc2NC(=O)C[C@@H](C)Nc12)c1ccccc1
InChI Key: InChIKey=GHJLEIJLRPAVKG-OLZOCXBDSA-N
Data: 2 IC50  1 EC50
Activity Spreadsheet -- Enzyme Inhibition Constant Data from BindingDB
Found 3 hits for monomerid = 50178181
Trg + Lig
Ki
nM
ΔG°
kcal/mole
IC50
nM
Kd
nM
EC50/IC50
nM
koff
s-1
kon
M-1s-1
pHTemp
°C
Bromodomain-containing protein 4
(Homo sapiens (Human))
BDBM50178181
(CHEMBL3813744)
Show SMILES C[C@H](NC(=O)c1cccc2NC(=O)C[C@@H](C)Nc12)c1ccccc1 |r|
Show InChI InChI=1S/C19H21N3O2/c1-12-11-17(23)22-16-10-6-9-15(18(16)20-12)19(24)21-13(2)14-7-4-3-5-8-14/h3-10,12-13,20H,11H2,1-2H3,(H,21,24)(H,22,23)/t12-,13+/m1/s1
n/an/a>2.00E+4n/an/an/an/an/an/a
Constellation Pharmaceuticals
Curated by ChEMBL
Assay Description
Displacement of biotinylated ligand from recombinant His-tagged BRD4 bromodomain-1 (unknown origin) incubated for 10 mins by TR-FRET assay
ACS Med Chem Lett 7: 531-6 (2016)
BindingDB Entry DOI: 10.7270/Q20G3N3S
CREB-binding protein
(Homo sapiens (Human))
BDBM50178181
(CHEMBL3813744)
Show SMILES C[C@H](NC(=O)c1cccc2NC(=O)C[C@@H](C)Nc12)c1ccccc1 |r|
Show InChI InChI=1S/C19H21N3O2/c1-12-11-17(23)22-16-10-6-9-15(18(16)20-12)19(24)21-13(2)14-7-4-3-5-8-14/h3-10,12-13,20H,11H2,1-2H3,(H,21,24)(H,22,23)/t12-,13+/m1/s1
Reactome pathway
n/an/an/an/a>1.00E+4n/an/an/an/a
Constellation Pharmaceuticals
Curated by ChEMBL
Assay Description
Inhibition of Halo-tagged histone H3.3 binding to CBP (unknown origin) expressed in HEK293 cells after overnight incubation by luciferase reporter ge...
ACS Med Chem Lett 7: 531-6 (2016)
BindingDB Entry DOI: 10.7270/Q20G3N3S
CREB-binding protein
(Homo sapiens (Human))
BDBM50178181
(CHEMBL3813744)
Show SMILES C[C@H](NC(=O)c1cccc2NC(=O)C[C@@H](C)Nc12)c1ccccc1 |r|
Show InChI InChI=1S/C19H21N3O2/c1-12-11-17(23)22-16-10-6-9-15(18(16)20-12)19(24)21-13(2)14-7-4-3-5-8-14/h3-10,12-13,20H,11H2,1-2H3,(H,21,24)(H,22,23)/t12-,13+/m1/s1
Reactome pathway
n/an/a 5.00E+3n/an/an/an/an/an/a
Constellation Pharmaceuticals
Curated by ChEMBL
Assay Description
Displacement of biotinylated ligand from recombinant His-tagged CBP (unknown origin) incubated for 10 mins by TR-FRET assay
ACS Med Chem Lett 7: 531-6 (2016)
BindingDB Entry DOI: 10.7270/Q20G3N3S