BDBM50178199 CHEMBL2282031
SMILES: CC1CC(=O)Nc2ccccc2O1
InChI Key: InChIKey=ZPCZQESAHAVOLW-UHFFFAOYSA-N
Data: 2 IC50
Activity Spreadsheet -- Enzyme Inhibition Constant Data from BindingDB
Found 2 hits for monomerid = 50178199
Trg + Lig
Ki
nM
ΔG°
kcal/mole
IC50
nM
Kd
nM
EC50/IC50
nM
koff
s-1
kon
M-1s-1
pHTemp
°C
CREB-binding protein
(Homo sapiens (Human))
BDBM50178199
(CHEMBL2282031)
Show SMILES CC1CC(=O)Nc2ccccc2O1
Show InChI InChI=1S/C10H11NO2/c1-7-6-10(12)11-8-4-2-3-5-9(8)13-7/h2-5,7H,6H2,1H3,(H,11,12)
Reactome pathway
n/an/a 1.00E+4n/an/an/an/an/an/a
Constellation Pharmaceuticals
Curated by ChEMBL
Assay Description
Displacement of biotinylated ligand from recombinant His-tagged CBP (unknown origin) incubated for 10 mins by TR-FRET assay
ACS Med Chem Lett 7: 531-6 (2016)
BindingDB Entry DOI: 10.7270/Q20G3N3S
Bromodomain-containing protein 4
(Homo sapiens (Human))
BDBM50178199
(CHEMBL2282031)
Show SMILES CC1CC(=O)Nc2ccccc2O1
Show InChI InChI=1S/C10H11NO2/c1-7-6-10(12)11-8-4-2-3-5-9(8)13-7/h2-5,7H,6H2,1H3,(H,11,12)
n/an/a 8.00E+4n/an/an/an/an/an/a
Constellation Pharmaceuticals
Curated by ChEMBL
Assay Description
Displacement of biotinylated ligand from recombinant His-tagged BRD4 bromodomain-1 (unknown origin) incubated for 10 mins by TR-FRET assay
ACS Med Chem Lett 7: 531-6 (2016)
BindingDB Entry DOI: 10.7270/Q20G3N3S