BDBM50178459 6-(4-ethoxyphenyl)-4,5,7-trimethyl-N-((tetrahydrofuran-2-yl)methyl)-6H-pyrrolo[3,4-d]pyridazin-1-amine::CHEMBL425397
SMILES: CCOc1ccc(cc1)-n1c(C)c2c(C)nnc(NCC3CCCO3)c2c1C
InChI Key: InChIKey=FEBZPRWSSJUQKB-UHFFFAOYSA-N
Data: 1 IC50
Activity Spreadsheet -- Enzyme Inhibition Constant Data from BindingDB
Found 1 hit for monomerid = 50178459
Trg + Lig
Ki
nM
ΔG°
kcal/mole
IC50
nM
Kd
nM
EC50/IC50
nM
koff
s-1
kon
M-1s-1
pHTemp
°C
Voltage-dependent calcium channel subunit alpha-2/delta-1
(Homo sapiens (Human))
BDBM50178459
(6-(4-ethoxyphenyl)-4,5,7-trimethyl-N-((tetrahydrof...)
Show SMILES CCOc1ccc(cc1)-n1c(C)c2c(C)nnc(NCC3CCCO3)c2c1C
Show InChI InChI=1S/C22H28N4O2/c1-5-27-18-10-8-17(9-11-18)26-15(3)20-14(2)24-25-22(21(20)16(26)4)23-13-19-7-6-12-28-19/h8-11,19H,5-7,12-13H2,1-4H3,(H,23,25)
n/an/a 50n/an/an/an/an/an/a
Merck Research Laboratories
Curated by ChEMBL
Assay Description
[3H]Gabapentin binding in human A710 membrane expressing alpha2delta subunit of calcium channel
Bioorg Med Chem Lett 16: 746-9 (2005)
Article DOI: 10.1016/j.bmcl.2005.08.117
BindingDB Entry DOI: 10.7270/Q2X34X2M