BDBM50178698 CHEMBL3813720
SMILES: OC(CN[C@@](Cc1ccccc1)(c1cc(F)cc(OC(F)(F)C(F)F)c1)c1ccc(Cl)cn1)CC(F)(F)F
InChI Key: InChIKey=XBROGAQWWPPLOD-BVHINDKJSA-N
Data: 2 IC50
Activity Spreadsheet -- Enzyme Inhibition Constant Data from BindingDB
Found 2 hits for monomerid = 50178698
Trg + Lig
Ki
nM
ΔG°
kcal/mole
IC50
nM
Kd
nM
EC50/IC50
nM
koff
s-1
kon
M-1s-1
pHTemp
°C
Cholesteryl ester transfer protein
(Homo sapiens (Human))
BDBM50178698
(CHEMBL3813720)
Show SMILES OC(CN[C@@](Cc1ccccc1)(c1cc(F)cc(OC(F)(F)C(F)F)c1)c1ccc(Cl)cn1)CC(F)(F)F |r|
Show InChI InChI=1S/C25H21ClF8N2O2/c26-17-6-7-21(35-13-17)23(11-15-4-2-1-3-5-15,36-14-19(37)12-24(30,31)32)16-8-18(27)10-20(9-16)38-25(33,34)22(28)29/h1-10,13,19,22,36-37H,11-12,14H2/t19?,23-/m0/s1
Reactome pathway
n/an/a 600n/an/an/an/an/an/a
Bristol-Myers Squibb Pharmaceutical Research Institute
Curated by ChEMBL
Assay Description
Inhibition of CETP in human whole plasma assessed as reduction in [3H]cholesteryl ester transfer from [3H]CE-HDL to LDL/VLDL
Bioorg Med Chem Lett 26: 3278-3281 (2016)
BindingDB Entry DOI: 10.7270/Q2TQ63FN
Cholesteryl ester transfer protein
(Homo sapiens (Human))
BDBM50178698
(CHEMBL3813720)
Show SMILES OC(CN[C@@](Cc1ccccc1)(c1cc(F)cc(OC(F)(F)C(F)F)c1)c1ccc(Cl)cn1)CC(F)(F)F |r|
Show InChI InChI=1S/C25H21ClF8N2O2/c26-17-6-7-21(35-13-17)23(11-15-4-2-1-3-5-15,36-14-19(37)12-24(30,31)32)16-8-18(27)10-20(9-16)38-25(33,34)22(28)29/h1-10,13,19,22,36-37H,11-12,14H2/t19?,23-/m0/s1
Reactome pathway
n/an/a 1.5n/an/an/an/an/an/a
Bristol-Myers Squibb Pharmaceutical Research Institute
Curated by ChEMBL
Assay Description
Inhibition of human recombinant CETP assessed as reduction in [3H]cholesteryl ester transfer from [3H]CE-HDL to biotinylated LDL by scintillation pro...
Bioorg Med Chem Lett 26: 3278-3281 (2016)
BindingDB Entry DOI: 10.7270/Q2TQ63FN