BDBM50178704 CHEMBL3814736
SMILES: CC(C)(C)c1ccc(Cn2c(cc3ncc(Cl)cc23)C(O)=O)cc1
InChI Key: InChIKey=WADFCGOZQFPMDL-UHFFFAOYSA-N
Data: 2 IC50
Activity Spreadsheet -- Enzyme Inhibition Constant Data from BindingDB
Found 2 hits for monomerid = 50178704
Trg + Lig
Ki
nM
ΔG°
kcal/mole
IC50
nM
Kd
nM
EC50/IC50
nM
koff
s-1
kon
M-1s-1
pHTemp
°C
C-C chemokine receptor type 9
(Homo sapiens (Human))
BDBM50178704
(CHEMBL3814736)
Show SMILES CC(C)(C)c1ccc(Cn2c(cc3ncc(Cl)cc23)C(O)=O)cc1
Show InChI InChI=1S/C19H19ClN2O2/c1-19(2,3)13-6-4-12(5-7-13)11-22-16-8-14(20)10-21-15(16)9-17(22)18(23)24/h4-10H,11H2,1-3H3,(H,23,24)
Reactome pathway
n/an/a 20n/an/an/an/an/an/a
Cubist Pharmaceuticals
Curated by ChEMBL
Assay Description
Antagonist activity at CCR9 (unknown origin) assessed as inhibition of TECK-stimulated calcium mobilization preincubated for 10 mins followed by agon...
Bioorg Med Chem Lett 26: 3322-3325 (2016)
BindingDB Entry DOI: 10.7270/Q2PZ5BQX
C-C chemokine receptor type 9
(Homo sapiens (Human))
BDBM50178704
(CHEMBL3814736)
Show SMILES CC(C)(C)c1ccc(Cn2c(cc3ncc(Cl)cc23)C(O)=O)cc1
Show InChI InChI=1S/C19H19ClN2O2/c1-19(2,3)13-6-4-12(5-7-13)11-22-16-8-14(20)10-21-15(16)9-17(22)18(23)24/h4-10H,11H2,1-3H3,(H,23,24)
Reactome pathway
n/an/a 277n/an/an/an/an/an/a
Cubist Pharmaceuticals
Curated by ChEMBL
Assay Description
Inhibition of CCR9-mediated chemotaxis in human MOLT4 cells preincubated for 10 mins followed by TECK addition in presence of 0.1% BSA measured after...
Bioorg Med Chem Lett 26: 3322-3325 (2016)
BindingDB Entry DOI: 10.7270/Q2PZ5BQX