null
SMILES: Cc1cc(O)cc(C)c1C[C@H](N)C(=O)N1Cc2ccccc2CC1C(=O)NCCCCc1nc(C)c(CCCNC(=O)C2Cc3ccccc3CN2C(=O)[C@@H](N)Cc2c(C)cc(O)cc2C)[nH]c1=O
InChI Key: InChIKey=CHKFIUAMEUVMNR-FHRQCFKPSA-N
Activity Spreadsheet -- Enzyme Inhibition Constant Data from BindingDB
Found 4 hits for monomerid = 50178757
Trg + Lig
Ki
nM
ΔG°
kcal/mole
IC50
nM
Kd
nM
EC50/IC50
nM
koff
s-1
kon
M-1s-1
pHTemp
°C
Delta-type opioid receptor
(Rattus norvegicus (rat))
BDBM50178757
(3-(Dmt-Tic-NH-butyl)-6-(Dmt-Tic-NH-propyl)-2-(1H)-...)
Show SMILES Cc1cc(O)cc(C)c1C[C@H](N)C(=O)N1Cc2ccccc2CC1C(=O)NCCCCc1nc(C)c(CCCNC(=O)C2Cc3ccccc3CN2C(=O)[C@@H](N)Cc2c(C)cc(O)cc2C)[nH]c1=O
Show InChI InChI=1S/C54H66N8O7/c1-31-21-40(63)22-32(2)42(31)27-44(55)53(68)61-29-38-15-8-6-13-36(38)25-48(61)51(66)57-19-11-10-17-47-50(65)60-46(35(5)59-47)18-12-20-58-52(67)49-26-37-14-7-9-16-39(37)30-62(49)54(69)45(56)28-43-33(3)23-41(64)24-34(43)4/h6-9,13-16,21-24,44-45,48-49,63-64H,10-12,17-20,25-30,55-56H2,1-5H3,(H,57,66)(H,58,67)(H,60,65)/t44-,45-,48?,49?/m0/s1
Reactome pathway
0.0920n/an/an/an/an/an/an/an/a
Kobe Gakuin University
Curated by ChEMBL
Assay Description
Displacement of [3H]deltorphin-II from delta opioid receptor in rat brain synaptosomal membranes
J Med Chem 48: 8035-44 (2005)
Article DOI: 10.1021/jm050377l
BindingDB Entry DOI: 10.7270/Q2C53KD9
Mu-type opioid receptor
(Rattus norvegicus (rat))
BDBM50178757
(3-(Dmt-Tic-NH-butyl)-6-(Dmt-Tic-NH-propyl)-2-(1H)-...)
Show SMILES Cc1cc(O)cc(C)c1C[C@H](N)C(=O)N1Cc2ccccc2CC1C(=O)NCCCCc1nc(C)c(CCCNC(=O)C2Cc3ccccc3CN2C(=O)[C@@H](N)Cc2c(C)cc(O)cc2C)[nH]c1=O
Show InChI InChI=1S/C54H66N8O7/c1-31-21-40(63)22-32(2)42(31)27-44(55)53(68)61-29-38-15-8-6-13-36(38)25-48(61)51(66)57-19-11-10-17-47-50(65)60-46(35(5)59-47)18-12-20-58-52(67)49-26-37-14-7-9-16-39(37)30-62(49)54(69)45(56)28-43-33(3)23-41(64)24-34(43)4/h6-9,13-16,21-24,44-45,48-49,63-64H,10-12,17-20,25-30,55-56H2,1-5H3,(H,57,66)(H,58,67)(H,60,65)/t44-,45-,48?,49?/m0/s1
Reactome pathway
2.28n/an/an/an/an/an/an/an/a
Kobe Gakuin University
Curated by ChEMBL
Assay Description
Displacement of [3H]DAMGO from mu opioid receptor expressed in rat brain synaptosomal membranes
J Med Chem 48: 8035-44 (2005)
Article DOI: 10.1021/jm050377l
BindingDB Entry DOI: 10.7270/Q2C53KD9
Mu-type opioid receptor
(GUINEA PIG)
BDBM50178757
(3-(Dmt-Tic-NH-butyl)-6-(Dmt-Tic-NH-propyl)-2-(1H)-...)
Show SMILES Cc1cc(O)cc(C)c1C[C@H](N)C(=O)N1Cc2ccccc2CC1C(=O)NCCCCc1nc(C)c(CCCNC(=O)C2Cc3ccccc3CN2C(=O)[C@@H](N)Cc2c(C)cc(O)cc2C)[nH]c1=O
Show InChI InChI=1S/C54H66N8O7/c1-31-21-40(63)22-32(2)42(31)27-44(55)53(68)61-29-38-15-8-6-13-36(38)25-48(61)51(66)57-19-11-10-17-47-50(65)60-46(35(5)59-47)18-12-20-58-52(67)49-26-37-14-7-9-16-39(37)30-62(49)54(69)45(56)28-43-33(3)23-41(64)24-34(43)4/h6-9,13-16,21-24,44-45,48-49,63-64H,10-12,17-20,25-30,55-56H2,1-5H3,(H,57,66)(H,58,67)(H,60,65)/t44-,45-,48?,49?/m0/s1
n/an/a>1.00E+4n/an/an/an/an/an/a
Kobe Gakuin University
Curated by ChEMBL
Assay Description
Agonistic activity at mu opioid receptor in myenteric plexus longitudinal muscle of guinea pig ileum
J Med Chem 48: 8035-44 (2005)
Article DOI: 10.1021/jm050377l
BindingDB Entry DOI: 10.7270/Q2C53KD9
Delta-type opioid receptor
(MOUSE)
BDBM50178757
(3-(Dmt-Tic-NH-butyl)-6-(Dmt-Tic-NH-propyl)-2-(1H)-...)
Show SMILES Cc1cc(O)cc(C)c1C[C@H](N)C(=O)N1Cc2ccccc2CC1C(=O)NCCCCc1nc(C)c(CCCNC(=O)C2Cc3ccccc3CN2C(=O)[C@@H](N)Cc2c(C)cc(O)cc2C)[nH]c1=O
Show InChI InChI=1S/C54H66N8O7/c1-31-21-40(63)22-32(2)42(31)27-44(55)53(68)61-29-38-15-8-6-13-36(38)25-48(61)51(66)57-19-11-10-17-47-50(65)60-46(35(5)59-47)18-12-20-58-52(67)49-26-37-14-7-9-16-39(37)30-62(49)54(69)45(56)28-43-33(3)23-41(64)24-34(43)4/h6-9,13-16,21-24,44-45,48-49,63-64H,10-12,17-20,25-30,55-56H2,1-5H3,(H,57,66)(H,58,67)(H,60,65)/t44-,45-,48?,49?/m0/s1
Reactome pathway
n/an/a>1.00E+4n/an/an/an/an/an/a
Kobe Gakuin University
Curated by ChEMBL
Assay Description
Agonistic activity at delta opioid receptor in mouse vas deferens
J Med Chem 48: 8035-44 (2005)
Article DOI: 10.1021/jm050377l
BindingDB Entry DOI: 10.7270/Q2C53KD9