BDBM50178806 CHEMBL370195::N-(5-chloro-2-(phenylthio)phenyl)-4-nitrobenzamide
SMILES: [O-][N+](=O)c1ccc(cc1)C(=O)Nc1cc(Cl)ccc1Sc1ccccc1
InChI Key: InChIKey=STCXDCJXIRPBMF-UHFFFAOYSA-N
Data: 1 KI  1 IC50
Activity Spreadsheet -- Enzyme Inhibition Constant Data from BindingDB
Found 2 hits for monomerid = 50178806
Trg + Lig
Ki
nM
ΔG°
kcal/mole
IC50
nM
Kd
nM
EC50/IC50
nM
koff
s-1
kon
M-1s-1
pHTemp
°C
Trypanothione reductase
(Trypanosoma cruzi)
BDBM50178806
(CHEMBL370195 | N-(5-chloro-2-(phenylthio)phenyl)-4...)
Show SMILES [O-][N+](=O)c1ccc(cc1)C(=O)Nc1cc(Cl)ccc1Sc1ccccc1
Show InChI InChI=1S/C19H13ClN2O3S/c20-14-8-11-18(26-16-4-2-1-3-5-16)17(12-14)21-19(23)13-6-9-15(10-7-13)22(24)25/h1-12H,(H,21,23)
4.28E+4n/an/an/an/an/an/an/an/a
University of Manchester
Curated by ChEMBL
Assay Description
Mixed inhibition of trypanothione reductase from Trypanosoma cruzi using TSST substrate
J Med Chem 48: 8087-97 (2005)
Article DOI: 10.1021/jm050819t
BindingDB Entry DOI: 10.7270/Q2V69J65
Trypanothione reductase
(Trypanosoma cruzi)
BDBM50178806
(CHEMBL370195 | N-(5-chloro-2-(phenylthio)phenyl)-4...)
Show SMILES [O-][N+](=O)c1ccc(cc1)C(=O)Nc1cc(Cl)ccc1Sc1ccccc1
Show InChI InChI=1S/C19H13ClN2O3S/c20-14-8-11-18(26-16-4-2-1-3-5-16)17(12-14)21-19(23)13-6-9-15(10-7-13)22(24)25/h1-12H,(H,21,23)
n/an/a 4.45E+4n/an/an/an/an/an/a
University of Manchester
Curated by ChEMBL
Assay Description
Mixed inhibition of trypanothione reductase from Trypanosoma cruzi using TSST substrate
J Med Chem 48: 8087-97 (2005)
Article DOI: 10.1021/jm050819t
BindingDB Entry DOI: 10.7270/Q2V69J65