BDBM50178811 CHEMBL199020::N-(3-aminopropyl)-4-tert-butyl-N,N-dimethylbenzenaminium
SMILES: CC(C)(C)c1ccc(cc1)[N+](C)(C)CCCN
InChI Key: InChIKey=YVVNAYUSFCYGPS-UHFFFAOYSA-N
Data: 1 KI  1 IC50
Activity Spreadsheet -- Enzyme Inhibition Constant Data from BindingDB
Found 2 hits for monomerid = 50178811
Trg + Lig
Ki
nM
ΔG°
kcal/mole
IC50
nM
Kd
nM
EC50/IC50
nM
koff
s-1
kon
M-1s-1
pHTemp
°C
Trypanothione reductase
(Trypanosoma cruzi)
BDBM50178811
(CHEMBL199020 | N-(3-aminopropyl)-4-tert-butyl-N,N-...)
Show SMILES CC(C)(C)c1ccc(cc1)[N+](C)(C)CCCN
Show InChI InChI=1S/C15H27N2/c1-15(2,3)13-7-9-14(10-8-13)17(4,5)12-6-11-16/h7-10H,6,11-12,16H2,1-5H3/q+1
150n/an/an/an/an/an/an/an/a
University of Manchester
Curated by ChEMBL
Assay Description
Mixed inhibition of trypanothione reductase from Trypanosoma cruzi using TSST substrate
J Med Chem 48: 8087-97 (2005)
Article DOI: 10.1021/jm050819t
BindingDB Entry DOI: 10.7270/Q2V69J65
Trypanothione reductase
(Trypanosoma cruzi)
BDBM50178811
(CHEMBL199020 | N-(3-aminopropyl)-4-tert-butyl-N,N-...)
Show SMILES CC(C)(C)c1ccc(cc1)[N+](C)(C)CCCN
Show InChI InChI=1S/C15H27N2/c1-15(2,3)13-7-9-14(10-8-13)17(4,5)12-6-11-16/h7-10H,6,11-12,16H2,1-5H3/q+1
n/an/a 600n/an/an/an/an/an/a
University of Manchester
Curated by ChEMBL
Assay Description
Inhibitory activity aganist trypanothione reductase from Trypanosoma cruzi using 0.12 mM TSST substrate
J Med Chem 48: 8087-97 (2005)
Article DOI: 10.1021/jm050819t
BindingDB Entry DOI: 10.7270/Q2V69J65