BDBM50178925 9-cyclopropyl-6-fluoro-7-(3-(piperidin-2-yl)phenyl)isothiazolo[5,4-b]quinoline-3,4(2H,9H)-dione::CHEMBL438444
SMILES: Fc1cc2c(cc1-c1cccc(c1)C1CCCCN1)n(C1CC1)c1s[nH]c(=O)c1c2=O
InChI Key: InChIKey=PKSRQRFDRMZEJO-UHFFFAOYSA-N
Data: 2 IC50
Activity Spreadsheet -- Enzyme Inhibition Constant Data from BindingDB
Found 2 hits for monomerid = 50178925
Trg + Lig
Ki
nM
ΔG°
kcal/mole
IC50
nM
Kd
nM
EC50/IC50
nM
koff
s-1
kon
M-1s-1
pHTemp
°C
DNA gyrase subunit A/B
(Escherichia coli (strain K12))
BDBM50178925
(9-cyclopropyl-6-fluoro-7-(3-(piperidin-2-yl)phenyl...)
Show SMILES Fc1cc2c(cc1-c1cccc(c1)C1CCCCN1)n(C1CC1)c1s[nH]c(=O)c1c2=O
Show InChI InChI=1S/C24H22FN3O2S/c25-18-11-17-20(28(15-7-8-15)24-21(22(17)29)23(30)27-31-24)12-16(18)13-4-3-5-14(10-13)19-6-1-2-9-26-19/h3-5,10-12,15,19,26H,1-2,6-9H2,(H,27,30)
n/an/a 700n/an/an/an/an/an/a
Achillion Pharmaceuticals, Inc.
Curated by ChEMBL
Assay Description
Inhibitory activity against wild type Escherichia coli gyrase
Bioorg Med Chem Lett 16: 1272-6 (2006)
Article DOI: 10.1016/j.bmcl.2005.11.065
BindingDB Entry DOI: 10.7270/Q22R3R76
DNA topoisomerase 4 subunit A
(Staphylococcus aureus)
BDBM50178925
(9-cyclopropyl-6-fluoro-7-(3-(piperidin-2-yl)phenyl...)
Show SMILES Fc1cc2c(cc1-c1cccc(c1)C1CCCCN1)n(C1CC1)c1s[nH]c(=O)c1c2=O
Show InChI InChI=1S/C24H22FN3O2S/c25-18-11-17-20(28(15-7-8-15)24-21(22(17)29)23(30)27-31-24)12-16(18)13-4-3-5-14(10-13)19-6-1-2-9-26-19/h3-5,10-12,15,19,26H,1-2,6-9H2,(H,27,30)
n/an/a 2.70E+3n/an/an/an/an/an/a
Achillion Pharmaceuticals, Inc.
Curated by ChEMBL
Assay Description
Inhibitory activity against wild type Staphylococcus aureus topoisomerase 4
Bioorg Med Chem Lett 16: 1272-6 (2006)
Article DOI: 10.1016/j.bmcl.2005.11.065
BindingDB Entry DOI: 10.7270/Q22R3R76