null
SMILES: Fc1cc2c(cc1N1CCNCC1)n(C1CC1)c1s[nH]c(=O)c1c2=O
InChI Key: InChIKey=BEZDZMQEVWAVTH-UHFFFAOYSA-N
Activity Spreadsheet -- Enzyme Inhibition Constant Data from BindingDB
Found 2 hits for monomerid = 50178926
Trg + Lig
Ki
nM
ΔG°
kcal/mole
IC50
nM
Kd
nM
EC50/IC50
nM
koff
s-1
kon
M-1s-1
pHTemp
°C
DNA gyrase subunit A/B
(Escherichia coli (strain K12))
BDBM50178926
(9-cyclopropyl-6-fluoro-7-(piperazin-1-yl)isothiazo...)
Show SMILES Fc1cc2c(cc1N1CCNCC1)n(C1CC1)c1s[nH]c(=O)c1c2=O
Show InChI InChI=1S/C17H17FN4O2S/c18-11-7-10-12(8-13(11)21-5-3-19-4-6-21)22(9-1-2-9)17-14(15(10)23)16(24)20-25-17/h7-9,19H,1-6H2,(H,20,24)
n/an/a 100n/an/an/an/an/an/a
Achillion Pharmaceuticals, Inc.
Curated by ChEMBL
Assay Description
Inhibitory activity against wild type Escherichia coli gyrase
Bioorg Med Chem Lett 16: 1272-6 (2006)
Article DOI: 10.1016/j.bmcl.2005.11.065
BindingDB Entry DOI: 10.7270/Q22R3R76
DNA topoisomerase 4 subunit A
(Staphylococcus aureus)
BDBM50178926
(9-cyclopropyl-6-fluoro-7-(piperazin-1-yl)isothiazo...)
Show SMILES Fc1cc2c(cc1N1CCNCC1)n(C1CC1)c1s[nH]c(=O)c1c2=O
Show InChI InChI=1S/C17H17FN4O2S/c18-11-7-10-12(8-13(11)21-5-3-19-4-6-21)22(9-1-2-9)17-14(15(10)23)16(24)20-25-17/h7-9,19H,1-6H2,(H,20,24)
n/an/a 500n/an/an/an/an/an/a
Achillion Pharmaceuticals, Inc.
Curated by ChEMBL
Assay Description
Inhibitory activity against wild type Staphylococcus aureus topoisomerase 4
Bioorg Med Chem Lett 16: 1272-6 (2006)
Article DOI: 10.1016/j.bmcl.2005.11.065
BindingDB Entry DOI: 10.7270/Q22R3R76