BDBM50178935 CHEMBL383422::N1-(2-((dimethylamino)methyl)phenyl)-4-methylbenzene-1,2-diamine
SMILES: CN(C)Cc1ccccc1Nc1ccc(C)cc1N
InChI Key: InChIKey=HWLVSITUDAPLNE-UHFFFAOYSA-N
Data: 1 KI  2 IC50
Activity Spreadsheet -- Enzyme Inhibition Constant Data from BindingDB
Found 3 hits for monomerid = 50178935
Trg + Lig
Ki
nM
ΔG°
kcal/mole
IC50
nM
Kd
nM
EC50/IC50
nM
koff
s-1
kon
M-1s-1
pHTemp
°C
Sodium-dependent serotonin transporter
(Homo sapiens (Human))
BDBM50178935
(CHEMBL383422 | N1-(2-((dimethylamino)methyl)phenyl...)
Show SMILES CN(C)Cc1ccccc1Nc1ccc(C)cc1N
Show InChI InChI=1S/C16H21N3/c1-12-8-9-16(14(17)10-12)18-15-7-5-4-6-13(15)11-19(2)3/h4-10,18H,11,17H2,1-3H3
10.3n/an/an/an/an/an/an/an/a
INSERM
Curated by ChEMBL
Assay Description
Displacement of [3H]paroxetine from SERT
Bioorg Med Chem Lett 16: 1297-300 (2006)
Article DOI: 10.1016/j.bmcl.2005.11.066
BindingDB Entry DOI: 10.7270/Q2Z037R6
Sodium-dependent noradrenaline transporter
(Homo sapiens (Human))
BDBM50178935
(CHEMBL383422 | N1-(2-((dimethylamino)methyl)phenyl...)
Show SMILES CN(C)Cc1ccccc1Nc1ccc(C)cc1N
Show InChI InChI=1S/C16H21N3/c1-12-8-9-16(14(17)10-12)18-15-7-5-4-6-13(15)11-19(2)3/h4-10,18H,11,17H2,1-3H3
Reactome pathway
n/an/a>100n/an/an/an/an/an/a
INSERM
Curated by ChEMBL
Assay Description
Inhibitory activity against NET
Bioorg Med Chem Lett 16: 1297-300 (2006)
Article DOI: 10.1016/j.bmcl.2005.11.066
BindingDB Entry DOI: 10.7270/Q2Z037R6
Sodium-dependent dopamine transporter
(Homo sapiens (Human))
BDBM50178935
(CHEMBL383422 | N1-(2-((dimethylamino)methyl)phenyl...)
Show SMILES CN(C)Cc1ccccc1Nc1ccc(C)cc1N
Show InChI InChI=1S/C16H21N3/c1-12-8-9-16(14(17)10-12)18-15-7-5-4-6-13(15)11-19(2)3/h4-10,18H,11,17H2,1-3H3
NCI pathway
Reactome pathway
n/an/a>100n/an/an/an/an/an/a
INSERM
Curated by ChEMBL
Assay Description
Inhibitory activity against DAT
Bioorg Med Chem Lett 16: 1297-300 (2006)
Article DOI: 10.1016/j.bmcl.2005.11.066
BindingDB Entry DOI: 10.7270/Q2Z037R6