BDBM50179206 3-trifluoromethyl-N-(6,7-dimethoxy-2,4-dihydroindeno[1,2-c]pyrazol-3-yl)phenylamine::CHEMBL184948
SMILES: COc1cc2Cc3c(Nc4cccc(c4)C(F)(F)F)[nH]nc3-c2cc1OC
InChI Key: InChIKey=DBGIFKODXXMSAS-UHFFFAOYSA-N
Data: 2 IC50
Activity Spreadsheet -- Enzyme Inhibition Constant Data from BindingDB
Found 2 hits for monomerid = 50179206
Trg + Lig
Ki
nM
ΔG°
kcal/mole
IC50
nM
Kd
nM
EC50/IC50
nM
koff
s-1
kon
M-1s-1
pHTemp
°C
Platelet-derived growth factor receptor beta
(Homo sapiens (Human))
BDBM50179206
(3-trifluoromethyl-N-(6,7-dimethoxy-2,4-dihydroinde...)
Show SMILES COc1cc2Cc3c(Nc4cccc(c4)C(F)(F)F)[nH]nc3-c2cc1OC
Show InChI InChI=1S/C19H16F3N3O2/c1-26-15-7-10-6-14-17(13(10)9-16(15)27-2)24-25-18(14)23-12-5-3-4-11(8-12)19(20,21)22/h3-5,7-9H,6H2,1-2H3,(H2,23,24,25)
NCI pathway
Reactome pathway
n/an/a 1n/an/an/an/an/an/a
Johnson & Johnson Pharmaceutical Research and Development
Curated by ChEMBL
Assay Description
Antiproliferative activity against PDGF-BB stimulated HCASMC
J Med Chem 48: 8163-73 (2005)
Article DOI: 10.1021/jm050680m
BindingDB Entry DOI: 10.7270/Q2W095HW
Platelet-derived growth factor receptor beta
(Homo sapiens (Human))
BDBM50179206
(3-trifluoromethyl-N-(6,7-dimethoxy-2,4-dihydroinde...)
Show SMILES COc1cc2Cc3c(Nc4cccc(c4)C(F)(F)F)[nH]nc3-c2cc1OC
Show InChI InChI=1S/C19H16F3N3O2/c1-26-15-7-10-6-14-17(13(10)9-16(15)27-2)24-25-18(14)23-12-5-3-4-11(8-12)19(20,21)22/h3-5,7-9H,6H2,1-2H3,(H2,23,24,25)
NCI pathway
Reactome pathway
n/an/a 38n/an/an/an/an/an/a
Johnson & Johnson Pharmaceutical Research and Development
Curated by ChEMBL
Assay Description
Inhibitory activity against PDGFRbeta kinase
J Med Chem 48: 8163-73 (2005)
Article DOI: 10.1021/jm050680m
BindingDB Entry DOI: 10.7270/Q2W095HW