BDBM50179318 2-dimethylamino-5,8-dihydro-4H,6H-thiopyrano[4',3':4,5]thieno[2,3-d][1,3]oxazin-4-one::CHEMBL107171
SMILES: CN(C)c1nc2sc3CSCCc3c2c(=O)o1
InChI Key: InChIKey=WFMXQQDMHFVWSO-UHFFFAOYSA-N
Data: 1 KI  1 IC50
Activity Spreadsheet -- Enzyme Inhibition Constant Data from BindingDB
Found 2 hits for monomerid = 50179318
Trg + Lig
Ki
nM
ΔG°
kcal/mole
IC50
nM
Kd
nM
EC50/IC50
nM
koff
s-1
kon
M-1s-1
pHTemp
°C
Cholesterol esterase
(Bos taurus)
BDBM50179318
(2-dimethylamino-5,8-dihydro-4H,6H-thiopyrano[4',3'...)
Show SMILES CN(C)c1nc2sc3CSCCc3c2c(=O)o1
Show InChI InChI=1S/C11H12N2O2S2/c1-13(2)11-12-9-8(10(14)15-11)6-3-4-16-5-7(6)17-9/h3-5H2,1-2H3
5.76E+3n/an/an/an/an/an/an/an/a
University of Bonn
Curated by ChEMBL
Assay Description
Inhibitory activity against bovine pancreatic CEase in presence of pNPB chromogenic substrate by spectrophotometry
J Med Chem 48: 8270-88 (2005)
Article DOI: 10.1021/jm0508639
BindingDB Entry DOI: 10.7270/Q2GQ6XB4
Acetylcholinesterase
(Electrophorus electricus (Electric eel))
BDBM50179318
(2-dimethylamino-5,8-dihydro-4H,6H-thiopyrano[4',3'...)
Show SMILES CN(C)c1nc2sc3CSCCc3c2c(=O)o1
Show InChI InChI=1S/C11H12N2O2S2/c1-13(2)11-12-9-8(10(14)15-11)6-3-4-16-5-7(6)17-9/h3-5H2,1-2H3
n/an/a>5.00E+4n/an/an/an/an/an/a
University of Bonn
Curated by ChEMBL
Assay Description
Inhibitory activity AChE from Electrophorus electricus using ATCh substrate and DTNB by spectrophotometry
J Med Chem 48: 8270-88 (2005)
Article DOI: 10.1021/jm0508639
BindingDB Entry DOI: 10.7270/Q2GQ6XB4