BDBM50179330 2-benzoylamino-7-benzyl-5,6,7,8-tetrahydro-4H-pyrido[4',3':4,5]thieno[2,3-d][1,3]oxazin-4-one::CHEMBL169148
SMILES: O=C(Nc1nc2sc3CN(Cc4ccccc4)CCc3c2c(=O)o1)c1ccccc1
InChI Key: InChIKey=BFQYYEGZVMBGNW-UHFFFAOYSA-N
Data: 1 KI  1 IC50
Activity Spreadsheet -- Enzyme Inhibition Constant Data from BindingDB
Found 2 hits for monomerid = 50179330
Trg + Lig
Ki
nM
ΔG°
kcal/mole
IC50
nM
Kd
nM
EC50/IC50
nM
koff
s-1
kon
M-1s-1
pHTemp
°C
Cholesterol esterase
(Bos taurus)
BDBM50179330
(2-benzoylamino-7-benzyl-5,6,7,8-tetrahydro-4H-pyri...)
Show SMILES O=C(Nc1nc2sc3CN(Cc4ccccc4)CCc3c2c(=O)o1)c1ccccc1
Show InChI InChI=1S/C23H19N3O3S/c27-20(16-9-5-2-6-10-16)24-23-25-21-19(22(28)29-23)17-11-12-26(14-18(17)30-21)13-15-7-3-1-4-8-15/h1-10H,11-14H2,(H,24,25,27)
>5.00E+4n/an/an/an/an/an/an/an/a
University of Bonn
Curated by ChEMBL
Assay Description
Inhibitory activity against bovine pancreatic CEase in presence of pNPB chromogenic substrate by spectrophotometry
J Med Chem 48: 8270-88 (2005)
Article DOI: 10.1021/jm0508639
BindingDB Entry DOI: 10.7270/Q2GQ6XB4
Acetylcholinesterase
(Electrophorus electricus (Electric eel))
BDBM50179330
(2-benzoylamino-7-benzyl-5,6,7,8-tetrahydro-4H-pyri...)
Show SMILES O=C(Nc1nc2sc3CN(Cc4ccccc4)CCc3c2c(=O)o1)c1ccccc1
Show InChI InChI=1S/C23H19N3O3S/c27-20(16-9-5-2-6-10-16)24-23-25-21-19(22(28)29-23)17-11-12-26(14-18(17)30-21)13-15-7-3-1-4-8-15/h1-10H,11-14H2,(H,24,25,27)
n/an/a 2.86E+3n/an/an/an/an/an/a
University of Bonn
Curated by ChEMBL
Assay Description
Inhibitory activity AChE from Electrophorus electricus using ATCh substrate and DTNB by spectrophotometry
J Med Chem 48: 8270-88 (2005)
Article DOI: 10.1021/jm0508639
BindingDB Entry DOI: 10.7270/Q2GQ6XB4