BDBM50179532 1-(biphenyl-3-ylamino)-cyclohexanecarboxylic acid {(S)-1-[(4-methoxy-phenylamino)-methyl]-propyl}-amide::CHEMBL264314
SMILES: CC[C@@H](CNc1ccc(OC)cc1)NC(=O)C1(CCCCC1)Nc1cccc(c1)-c1ccccc1
InChI Key: InChIKey=VLWARWUZFQLFRN-VWLOTQADSA-N
Data: 1 IC50
Activity Spreadsheet -- Enzyme Inhibition Constant Data from BindingDB
Found 1 hit for monomerid = 50179532
Trg + Lig
Ki
nM
ΔG°
kcal/mole
IC50
nM
Kd
nM
EC50/IC50
nM
koff
s-1
kon
M-1s-1
pHTemp
°C
Cathepsin K
(Homo sapiens (Human))
BDBM50179532
(1-(biphenyl-3-ylamino)-cyclohexanecarboxylic acid ...)
Show SMILES CC[C@@H](CNc1ccc(OC)cc1)NC(=O)C1(CCCCC1)Nc1cccc(c1)-c1ccccc1
Show InChI InChI=1S/C30H37N3O2/c1-3-25(22-31-26-15-17-28(35-2)18-16-26)32-29(34)30(19-8-5-9-20-30)33-27-14-10-13-24(21-27)23-11-6-4-7-12-23/h4,6-7,10-18,21,25,31,33H,3,5,8-9,19-20,22H2,1-2H3,(H,32,34)/t25-/m0/s1
Reactome pathway
n/an/a 2.70n/an/an/an/an/an/a
Sankyo Co., Ltd
Curated by ChEMBL
Assay Description
Inhibitory activity against recombinant human Cathepsin K
Bioorg Med Chem Lett 16: 1502-5 (2006)
Article DOI: 10.1016/j.bmcl.2005.12.053
BindingDB Entry DOI: 10.7270/Q2T154FS