null
SMILES: CC[C@@H](CNc1ccc(OCC(=O)OC(C)(C)C)cc1)NC(=O)C1(CCCCC1)Nc1cccc(c1)-c1ccccc1
InChI Key: InChIKey=LQAXLONNTRHUGX-NDEPHWFRSA-N
Activity Spreadsheet -- Enzyme Inhibition Constant Data from BindingDB
Found 1 hit for monomerid = 50179539
Trg + Lig
Ki
nM
ΔG°
kcal/mole
IC50
nM
Kd
nM
EC50/IC50
nM
koff
s-1
kon
M-1s-1
pHTemp
°C
Cathepsin K
(Homo sapiens (Human))
BDBM50179539
(CHEMBL383551 | [4-((S)-2-{[1-(biphenyl-3-ylamino)-...)
Show SMILES CC[C@@H](CNc1ccc(OCC(=O)OC(C)(C)C)cc1)NC(=O)C1(CCCCC1)Nc1cccc(c1)-c1ccccc1
Show InChI InChI=1S/C35H45N3O4/c1-5-28(24-36-29-17-19-31(20-18-29)41-25-32(39)42-34(2,3)4)37-33(40)35(21-10-7-11-22-35)38-30-16-12-15-27(23-30)26-13-8-6-9-14-26/h6,8-9,12-20,23,28,36,38H,5,7,10-11,21-22,24-25H2,1-4H3,(H,37,40)/t28-/m0/s1
Reactome pathway
n/an/a 4.80n/an/an/an/an/an/a
Sankyo Co., Ltd
Curated by ChEMBL
Assay Description
Inhibitory activity against recombinant human Cathepsin K
Bioorg Med Chem Lett 16: 1502-5 (2006)
Article DOI: 10.1016/j.bmcl.2005.12.053
BindingDB Entry DOI: 10.7270/Q2T154FS